nixbot

builds

fosskar/nixfiles build #1778 failed

branch main · PR #818 · commit fd475c6426 · · took 1h 38m

eval warnings 3 kinds · 13 occurrences
  • warn stdenv.isLinux is deprecated, use stdenv.hostPlatform.isLinux instead ×6
  • warn stdenv.isDarwin is deprecated, use stdenv.hostPlatform.isDarwin instead ×6
  • warn nixbot: gitea.* is configured but gitea.enable is false; Gitea projects will not appear. Set services.nixbot.gitea.enable = true. ×1

4 failed
failed attributes
status attribute duration
failed checks.x86_64-linux.nixos-desktop 1h 5m
xwayland-satellite-unstable-2026-08-08-3bc915f: Caused by: unable to update registry `crates-io` Caused by: failed to query replaced source registry `crates …
xwayland-satellite-unstable-2026-08-08-3bc915f:
Caused by:
  unable to update registry `crates-io`
Caused by:
  failed to query replaced source registry `crates-io`
Caused by:
  failed to parse manifest at `/build/cargo-vendor-dir/once_cell-1.21.3/Cargo.toml`
Caused by:
  manifest is missing either a `[package]` or a `[workspace]`

voxtype-onnx-migraphx-1.0.0:
Caused by:
  unable to update registry `crates-io`
Caused by:
  failed to query replaced source registry `crates-io`
Caused by:
  failed to parse manifest at `/build/cargo-vendor-dir/once_cell-1.21.3/Cargo.toml`
Caused by:
  manifest is missing either a `[package]` or a `[workspace]`

niri-unstable-2026-08-21-dd75865:
Caused by:
  unable to update registry `crates-io`
Caused by:
  failed to query replaced source registry `crates-io`
Caused by:
  failed to parse manifest at `/build/cargo-vendor-dir/phf-0.13.1/Cargo.toml`
Caused by:
  manifest is missing either a `[package]` or a `[workspace]`

… and 3 more failed derivations
failed checks.x86_64-linux.nixos-lpt-titan 1h 30m
zen-beta-bin-unwrapped-1.21.15b: ["patchelf", "--set-interpreter", interpreter_path.as_posix(), path.as_posix()] + extra_args, ^^^^^^^^^ …
zen-beta-bin-unwrapped-1.21.15b:
            ["patchelf", "--set-interpreter", interpreter_path.as_posix(), path.as_posix()] + extra_args,
            ^^^^^^^^^^^^^^^^^^^^^^^^^^^^^^^^^^^^^^^^^^^^^^^^^^^^^^^^^^^^^^^^^^^^^^^^^^^^^^^^^^^^^^^^^^^^^
            check=True)
            ^^^^^^^^^^^
  File "/nix/store/iiv95p7c9yxaz92f0jibwxcnix1w7f1i-python3-3.14.7-env/lib/python3.14/subprocess.py", line 578, in run
    raise CalledProcessError(retcode, process.args,
                             output=stdout, stderr=stderr)
subprocess.CalledProcessError: Command '['patchelf', '--set-interpreter', '/nix/store/n51dhmdbik1kfrsm62j5knavmigwrl1a-glibc-2.42-84/lib/ld-linux-x86-64.so.2', '/nix/store/rnfyn2kd0k1fil74ncpwqg8bcgj8dn80-zen-beta-bin-unwrapped-1.21.15b/bin/zen-beta', '--no-clobber-old-sections']' returned non-zero exit status 1.

voxtype-onnx-migraphx-1.0.0:
Caused by:
  unable to update registry `crates-io`
Caused by:
  failed to query replaced source registry `crates-io`
Caused by:
  failed to parse manifest at `/build/cargo-vendor-dir/once_cell-1.21.3/Cargo.toml`
Caused by:
  manifest is missing either a `[package]` or a `[workspace]`

buzz-desktop-0.5.20:
  unable to update registry `crates-io`
Caused by:
  failed to query replaced source registry `crates-io`
Caused by:
  failed to parse manifest at `/build/cargo-vendor-dir/phf-0.13.1/Cargo.toml`
Caused by:
  manifest is missing either a `[package]` or a `[workspace]`
       Error failed to build app: failed to build app

… and 3 more failed derivations
failed checks.x86_64-linux.nixos-nixbox 59m 14s
grub-2.12: install: cannot stat './grub-kbdcomp.1': No such file or directory make[3]: *** [Makefile:11971: install-man1] Error 1 make[3]: Leaving directory '/b …
grub-2.12:
install: cannot stat './grub-kbdcomp.1': No such file or directory
make[3]: *** [Makefile:11971: install-man1] Error 1
make[3]: Leaving directory '/build/grub'
make[2]: *** [Makefile:13273: install-am] Error 2
make[2]: Leaving directory '/build/grub'
make[1]: *** [Makefile:12168: install-recursive] Error 1
make[1]: Leaving directory '/build/grub'
make: *** [Makefile:13266: install] Error 2

stirling-pdf-2.14.3:
> Run with --info or --debug option to get more log output.
> Run with --scan to get full insights.
> Get more help at https://help.gradle.org.
Deprecated Gradle features were used in this build, making it incompatible with Gradle 9.0.
You can use '--warning-mode all' to show the individual deprecation warnings and determine if they come from your own scripts or plugins.
For more on this, please refer to https://docs.gradle.org/8.14.4/userguide/command_line_interface.html#sec:command_line_warnings in the Gradle documentation.
BUILD FAILED in 26m 29s
5 actionable tasks: 4 executed, 1 up-to-date
failed checks.x86_64-linux.nixos-nixworker 21m 46s
setup: warning: killing stray builder process 2357921 ()... warning: killing stray builder process 2358152 ()... warning: killing stray builder process 2358154 …
setup:
warning: killing stray builder process 2357921 ()...
warning: killing stray builder process 2358152 ()...
warning: killing stray builder process 2358154 ()...
warning: killing stray builder process 2358331 ()...
warning: killing stray builder process 2359120 ()...
waiting for 128 ms for cgroup "/sys/fs/cgroup/system.slice/nix-daemon.service/nix-build-uid-872415232" to become empty
waiting for 256 ms for cgroup "/sys/fs/cgroup/system.slice/nix-daemon.service/nix-build-uid-872415232" to become empty
error: deleting cgroup "/sys/fs/cgroup/system.slice/nix-daemon.service/nix-build-uid-872611840": Device or resource busy
6 succeeded
succeeded attributes
status attribute duration
loading…
21 already built
skipped attributes
status attribute duration
loading…