setup
checks.x86_64-linux.nixos-nixbox
· build #1778
· raw
1these 99 derivations will be built:2 /nix/store/02rjapgbk66zq3vpkk3mbgwlkvsbnsrp-vaultwarden.env.drv3 /nix/store/041x5b9kicns6y7s18f44ckvbm5kiai6-set-environment.drv4 /nix/store/0fqbsyhvq04sj9k3gfzbclrakz30b8mr-nodejs-26.8.1.drv5 /nix/store/h0496xb8hw1ldswv17xmpy5wnl5sv5nr-source.drv6 /nix/store/lgdrsb054mxv36a7drrn2q5zsnr1f86c-python3-3.14.7-env.drv7 /nix/store/0jzwv2qpjg5rxgya150slyhndq7hlcqh-sabnzbd-5.1.2.drv8 /nix/store/sh5c3ls5v1zx32wi9x29w75814i5sana-unit-hermes-agent.service.drv9 /nix/store/9pfi08ry03hkiz7xw4s2z7z1pzzchgjj-system-units.drv10 /nix/store/nlpxxqnk000vmmmdz3cdn512y7651ga6-user-environment.drv11 /nix/store/p1kk2kqdckvknnv5khrjgx67j39ljs0y-etc.drv12 /nix/store/d979fw4zzcg0q8r1h4vzqlicv3p3yzvh-activate.drv13 /nix/store/10ch2f6vvn77dj9ncdkfy4h1ij0nipk5-nixos-system-hermina-26.11pre-git.drv14 /nix/store/1xw10vfks2dwrnw51c6rdxbw43jv4fww-unit-opencloud-init-config.service.drv15 /nix/store/23543jvmq6614zkqffr6yl8xfsv43i7k-user-environment.drv16 /nix/store/8bmm656i4d7nfmrqp5lb23pysb5wfp62-unit-hermes-agent.service.drv17 /nix/store/s3p90qq4hjxcbqgc6h8jq2r1f8rjnkcp-system-units.drv18 /nix/store/x06v3ify5shpiak49z5z4700gfg52iip-etc.drv19 /nix/store/9qz7f9kd4gg4ciqjmz0qkb2xxrnkl4qg-activate.drv20 /nix/store/vk273qxr4xllxm6y8xdlkgip0bld8fhd-linux-6.18.48-modules-shrunk.drv21 /nix/store/kf0xrb7gakz6gbn556lwidjczqk4nkwr-initrd-linux-6.18.48.drv22 /nix/store/w9qjvpappgy95fg1rfyn6fxs9pff92fz-boot.json.drv23 /nix/store/zpwmjr9v3362kklwdrj764v9psnylr79-nixos-system-hermes-26.11pre-git.drv24 /nix/store/idci28vbga7ykraakayzks5hq56d29a4-closure-info.drv25 /nix/store/idsix0487i3mg5kzzgwzfglppal4skl2-microvm-hermes-microvm-run.drv26 /nix/store/2gsb52njnchn3qrf4az7nq6h0y38wvn2-microvm-cloud-hypervisor-hermes.drv27 /nix/store/fpsgi19g8qgg5rqx4lh2vld0v5dbj249-podman-docker-compat-5.8.6.drv28 /nix/store/wrhqq7r3m2sy84j9c0sww7l9zjfni837-nixos-container.drv29 /nix/store/m57ddqf6q4y0hdk6v2vrzkwsn9890d24-uname.drv30 /nix/store/y5sm2nnmw7s51ijqg4bv6k6nkzjq92f1-ryzen-smu-7.2.2-0.1.7-unstable-2026-08-15.drv31 /nix/store/zjmg58rqy4rr2ajxmvcwcksnhmkn7lwa-nvtop-3.3.2.drv32 /nix/store/qywviagx6124m3spxrqkkwnbv36gyhi2-system-path.drv33 /nix/store/l2xklg554awk5gc8k53cahla5b6pwkls-dbus-1.drv34 /nix/store/wrcznrghqhw8yglnf2nskvqdr8fn4jxf-X-Restart-Triggers-dbus-broker.drv35 /nix/store/2xg5wg4baz0ifln4iaj706b3qs8j7pjj-unit-dbus-broker.service.drv36 /nix/store/4mcrrl6y54hcib7dp4d363iva7k6yhfq-grub-2.12.drv37 /nix/store/3qj6vqx7yf967sw50vyyq9n6vhjabla2-grub-config.xml.drv38 /nix/store/3ra52gsjwz6gf7zrb3wmlb7saw6yjq49-linux-7.2.2-modules.drv39 /nix/store/42limrqny83ql8vws9136h2zj7zm4aqj-user-generators.drv40 /nix/store/azsixfk11dkb8h6a3v8kfxvar0c634m4-X-Restart-Triggers-polkit.drv41 /nix/store/47b199nc8gzciyyzyfv4pdnbs2gfy2yl-unit-polkit.service.drv42 /nix/store/4vpjlmd3fa0xa72820zclz1ir4zhllar-X-Restart-Triggers-microvm-hermes.drv43 /nix/store/494lw05lfl6qz221pl8fx4mbwyn8dvcl-unit-microvm-hermes.service.drv44 /nix/store/4j3awcrc5vrz21iarmjch1dnr0l3nzzs-unit-podman-prune.service.drv45 /nix/store/51sx0kdysmxg22cmp9xswssvz73lmmq7-etc-zshenv.drv46 /nix/store/sbxv725y11na0arlhpypcdij4p2l2z1m-unit-script-install-microvm-hermes-start.drv47 /nix/store/563lgnvrx6lhrkj7hflzi7ql6905nm59-unit-install-microvm-hermes.service.drv48 /nix/store/xkrk3659j9wjxlfm14c0a6c7fkk2difm-tmpfiles.d.drv49 /nix/store/hcmfw7jc7pmsfixhm4v2511sxdvsbrii-X-Restart-Triggers-systemd-tmpfiles-resetup.drv50 /nix/store/73nqs3npygazls77k4wyirsb8vps20mc-unit-systemd-tmpfiles-resetup.service.drv51 /nix/store/86yqr55b8nyx63ialidcnb5bm8nizqrd-start-bazarr.drv52 /nix/store/p5xg36nwrb2xfd295p84n66vw5km3c8j-element-web-wrapped-1.12.26.drv53 /nix/store/yh59r0js0r4ck606q5khgbplr1mhnl6n-Caddyfile.drv54 /nix/store/am8gcs29s15rwap8bmsnmjln3vz1fxxm-Caddyfile-formatted.drv55 /nix/store/j4zqk5102vgzsyzqjx5nw9avs5sk12hd-X-Reload-Triggers-caddy.drv56 /nix/store/8bngzapvc83flwh2qh69bxy7lb9xbxnv-unit-caddy.service.drv57 /nix/store/8n4qbzr1767cvwwzcdq6sj2scc6n69sf-unit-vaultwarden.service.drv58 /nix/store/l4rgyb0k2yn0lr8h5wwkgfs3ms9ggbhw-llama-cpp-10274.drv59 /nix/store/97ygwkkp39wrz5yrfwksy61hq2a5a33x-unit-llama-cpp.service.drv60 /nix/store/f6c2gi8r2x9rvn2bhljj879mp1cbcmk3-reload-container.drv61 /nix/store/waaa0imksnv182k1k7pfbi7wih85bkwx-etc-nixos-containers-hermina.conf.drv62 /nix/store/iz28wil85yp7jpgnp2djd1a76nh59him-X-Restart-Triggers-container-hermina.drv63 /nix/store/x619xf7pg8if1mwzzz85zy8l13djdib4-unit-script-container_hermina-start.drv64 /nix/store/a9akvpspvzsq5gsa45asnwhdzvz9h28f-unit-container-hermina.service.drv65 /nix/store/cxvbmzd3yy3pz1z2y9r4mxxjch83jc2y-unit-dbus-broker.service.drv66 /nix/store/d8gqn8n8lkz5nzldfjkws7rn0v9v67xk-system-shutdown.drv67 /nix/store/llcspc1pxv3jili4n12syp88k90w9s1b-etc-profile.drv68 /nix/store/dwfv2ihzyjyfswymclq5h69wswj7qph1-unit-immich-server.service.drv69 /nix/store/hhwvazm5y2yhgd2a019ipiw0zg30pqcw-stirling-pdf-2.14.3.drv70 /nix/store/h94bwg8wanqdlvxyq3rhi4fv5lb0wv63-unit-stirling-pdf.service.drv71 /nix/store/ip5k3ayb9y2m1f0hxj70wv7l30l6kx15-unit-jellyfin.service.drv72 /nix/store/kk52lpg0iv1k1ijfg4069y8kr6aq37w1-unit-sprout-track.service.drv73 /nix/store/lrq7a5vv9r1hyi8qib86shfiw7fpxqfb-unit-sprout-track-notification-cron.service.drv74 /nix/store/j6xqwkwkn8rwyjygir8jkkv9z3azx2h9-calendar-mcp-start.drv75 /nix/store/nf4giq52ydwijyygimcvhws9mzn07lsi-unit-calendar-mcp.service.drv76 /nix/store/nijw2pyl7w1n72vh8asyy19pa7viinxj-unit-container-.service.drv77 /nix/store/py7p22bgm3gmds6f04xx23p4rjjx0s7m-unit-tika.service.drv78 /nix/store/q0ffmhc5jhpsybax3x3qpb6f3cqrj0xb-unit-convertx.service.drv79 /nix/store/rwrdhw3zdcqlwzm4ndrqkn9g9qaghc1n-unit-opencloud.service.drv80 /nix/store/s1p2mfvbxgi6whjgxz1dh8890sv8r2w4-unit-immich-machine-learning.service.drv81 /nix/store/njhdrvjc9r1kzmxvlscb2vgd40kanlha-grafana-plugins.drv82 /nix/store/kvzpr9rlpfm4axahrxw7ffbrcs6p3zrw-config.ini.drv83 /nix/store/sc9nja7qmfaj2q11cdkxbq4f8xjbxmfq-unit-grafana.service.drv84 /nix/store/g13iqlda92lg65n8gmxrhfs4qb1iywky-shutdown-ramfs-contents.json.drv85 /nix/store/svxi9vyd3kfy778hbrllzpwansnci83s-unit-generate-shutdown-ramfs.service.drv86 /nix/store/xnxqdar04jp0najmbarm1x4p4wi7kjrs-unit-sabnzbd.service.drv87 /nix/store/nqh2m0hr76nsx4nhjbl62vb0by329qhi-manifest.json.drv88 /nix/store/ykll773dswrhyx5yhc5mnr8n9qgjjb31-unit-sops-install-secrets.service.drv89 /nix/store/zf6adjg7y1pn87r19f39f5yk0g78ca3l-unit-bazarr.service.drv90 /nix/store/pp5kjpabq5lbj3csaichni7z7xja0yjk-system-units.drv91 /nix/store/qx56da82h86xba18fzrw4ii1x58932sq-user-units.drv92 /nix/store/rjivsgb08ahr5s4ns4shmaxi1dj2js0c-system-generators.drv93 /nix/store/cy1cws4w1rrdzplv3dm942izihikb30k-etc.drv94 /nix/store/y0x20ngmngs4hkz3d9d4nrwjd07l3b2z-linux-7.2.2-modules-shrunk.drv95 /nix/store/da0wkl3byf3kr4647kaqbxkc1dyjr52l-initrd-linux-7.2.2.drv96 /nix/store/hsjwasjg2z01pl82bh0q5ayw6p4c69xs-activate.drv97 /nix/store/xzabm0mclzk8h30mqgh934f1hygfqwww-grub-config.xml.drv98 /nix/store/vbppqsj43kbszh64azgpr92srvy3zd9b-install-grub.sh.drv99 /nix/store/z57h5x6ifla93l5925x438rhw1iglshr-boot.json.drv100 /nix/store/ic8lkfgxskb7n62ais4mgqzbxyhlnksy-nixos-system-nixbox-26.11.20260829.d2f6794.drv101these 57 paths will be fetched (1.8 GiB download, 4.3 GiB unpacked):102 /nix/store/5xjzyjh4vh6v52fh1bnxill7rn2kldnn-55-nixos-aslr-entropy.conf103 /nix/store/8mh4gnil689l3c9rvqdarpzm7kinzjbi-bazarr-1.6.0104 /nix/store/3qgx41z8882ff85y9prdc5zgbb2id6y8-chromium-152.0.7977.64105 /nix/store/257kyf3i1cjkbi03nhsrq59r4j1cf12c-chromium-152.0.7977.64-sandbox106 /nix/store/bvajdx8xxf05dqrzwxgrlaxv0ryigzix-chromium-unwrapped-152.0.7977.64107 /nix/store/0lc80np1rfflpc3913p92s68j8i1q495-chromium-unwrapped-152.0.7977.64-sandbox108 /nix/store/rxwxdi7f5kh3gqqsdjzz6paz6znnngdc-convertx-0.18.0109 /nix/store/i2v86im08iwwyg3jaj1886756fbapmyg-crun-1.29.1110 /nix/store/7hb36isj7vziaxkzbaxj86p9gqxdw6ag-element-web-1.12.26111 /nix/store/byyb97scw0rvc8qipj6a629vag5dkvyv-grub-2.12112 /nix/store/gqyyq6a88zn1n881nb6xd1x0k7raq4v5-immich-3.1.0113 /nix/store/8j4ax2pap86ja9nh8vc3f8ja1jxm64cy-immich-machine-learning-3.1.0114 /nix/store/2vj45gfhapf3xc6d2x2f7c0wp1wi6d9q-jdk-tika115 /nix/store/wxkzaikwvklp7xcznx5zrzb2yxcg4ri4-jellyfin-10.11.11116 /nix/store/m6xbz1q7m302mdfjbdi2nr77rrghq9rv-jellyfin-ffmpeg-7.1.4-3-bin117 /nix/store/iqz68jm97q7yvxm07jfxf2mhmmlbn5lk-jellyfin-ffmpeg-7.1.4-3-data118 /nix/store/k42jvsg8y8qqzm0jfq50izc8ylj9x2ba-jellyfin-ffmpeg-7.1.4-3-lib119 /nix/store/d0v3hrg8lnvr7j2afrqnk2mxdb8s19l9-jellyfin-ffmpeg-7.1.4-3-man120 /nix/store/xd5kgp1himmwdwxsm8690bnk7459kg2l-linux-6.18.48-dev121 /nix/store/548dydq1qb5r423w10hzzhff4vwd4scf-linux-7.2.2122 /nix/store/yxq95msqp4lwb1wa44jcdwf7998170mi-linux-7.2.2-dev123 /nix/store/815fm0m9mbmx6gk3skqh0hgr40c7mwa4-linux-7.2.2-modules124 /nix/store/h72fslgll8pxhnhkjb44202fj1jw0nx9-nixos-container125 /nix/store/ppybqca4ijv2x6ncwipz6ys3lzknnrbl-nodejs-slim-26.8.1126 /nix/store/qj1y19hr1zn7pn75gxl45gm0gy05w606-nodejs-slim-26.8.1-npm127 /nix/store/2xqx5apy28xx51cw85rsliq7i94ii85b-nvidia-open-610.57.04-7.2.2128 /nix/store/5bl57qcjc4b4g086a1vi0nbr21ww7g4c-opencloud-7.5.0129 /nix/store/va2gamdxgy3gdq095dmw0klyc54kk3yi-opencloud-idp-web-7.5.0130 /nix/store/6f65fhlmbkmvpn0jdh6dgqaiwa1zcmqp-opencloud-web-7.4.0131 /nix/store/2qn6b1k7mqifxky17qyb1k7808z34ps4-openjdk-25.0.4.1+1132 /nix/store/qkdw99v92b5ps4ql1cqhiy8wxgs8pc8a-openjdk-minimal-jre-17.0.20.1+1133 /nix/store/fp2zc5aw2kricw285j3nr86gv9g9ma7b-pdfium-7749134 /nix/store/n7kmms479gjp75k6z8qjknpx1sp58cxv-pdfium-7749-dev135 /nix/store/y0srvs1m5y0jpsny33xwq1yqc022x7fa-podman-5.8.6136 /nix/store/j3aa25jy3hjw94ms4bii06dbmxscpjzk-podman-5.8.6-man137 /nix/store/nhj6kcdm054vyjkh5hivcmgld5zzvsyd-podman-helper-binary-wrapper138 /nix/store/3g09663fh34i1lw53yvq9ipl5rzwdkhs-podman-tmpfiles-nixos139 /nix/store/ilq2kf8pjj456239gl06p710bpf789w5-python3-3.14.7-env140 /nix/store/257im4g46y1y8p60wlzpcmrznmv6viws-python3.14-fpdf2-2.8.5141 /nix/store/na30nw380a0gk1grcana5bkphv77w57q-python3.14-hachoir-3.3.0142 /nix/store/2ldf57m3pnfy52rqcxy4mhzvmqvmphhc-python3.14-hf-xet-1.6.0143 /nix/store/l26jjiccxsd583bqgilb8wqza57dhf2n-python3.14-huggingface-hub-1.27.0144 /nix/store/lm58pcap4anr2l98wjs1s5izj8ryzk8q-python3.14-markitdown-0.1.7145 /nix/store/26y6b1pla5kbn9q6dvil3gj9r2413glf-python3.14-ocrmypdf-17.10.0146 /nix/store/30vpnmg2ll36iz3aw7wy28jabgzcqjid-python3.14-pdfplumber-0.11.10147 /nix/store/i55nr1xmvr0pzhqphj6lgvkwpyyak78i-python3.14-pypdfium2-5.11.0148 /nix/store/3hlcni0sbi3y9kpyijq8sqjw5f0m0200-python3.14-rarfile-4.5149 /nix/store/k13d0gdqk2hchlyvs293x5mlrndfxchn-python3.14-sabctools-9.6.3150 /nix/store/r6g1f2bk87f3gczic7ql3r8pmp3y9hq6-python3.14-speechrecognition-3.17.0151 /nix/store/fs9v2lf7f1y7mqdw8bvasvblflyyxmb1-python3.14-tokenizers-0.22.2152 /nix/store/967dy3npprvfyxg6847yr244sqsa5img-python3.14-urwid-3.0.5153 /nix/store/v6rzw07rc883sjby66wx14vj3bh0fh8c-tika-2.9.3154 /nix/store/lpq4qlaxiwmg5p4mzsbi8ayp5fgc3q8w-unifont-17.0.05155 /nix/store/a1fjdri8mkykx7ij95z29q2inq3xk7wq-unit-script-container_-start156 /nix/store/s378a699rlmyq9n54lv5yhqvm4h0akf7-vaultwarden-webvault-2026.7.0+0157 /nix/store/g5vfzs8ii1dsa2sskh14z6a1axxj91ii-victoriametrics-logs-datasource-0.31.0158 /nix/store/1pdgv6rfkl9plhak805hik2r6ylsvr9s-zfs-kernel-2.4.4-7.2.2159error: Cannot build '/nix/store/4mcrrl6y54hcib7dp4d363iva7k6yhfq-grub-2.12.drv'.160 Reason: builder failed with exit code 2.161 Output paths:162 /nix/store/cm8x76zcw4yagaknviy534iqnjps1574-grub-2.12163 /nix/store/nwq4z5n8rd0jpgqwm7k43bjsiv3ml53r-grub-2.12-debug164 Last 25 log lines:165 > install: cannot stat './grub-script-check.1': No such file or directory166 > install: cannot stat './grub-editenv.1': No such file or directory167 > install: cannot stat './grub-mkpasswd-pbkdf2.1': No such file or directory168 > install: cannot stat './grub-fstest.1'make[3]: *** [Makefile:12014: install-man8] Error 1169 > : No such file or directory170 > install: cannot stat './grub-mount.1': No such file or directory171 > make[3]: *** Waiting for unfinished jobs....172 > install: cannot stat './grub-mkfont.1': No such file or directory173 > install: cannot stat './grub-mklayout.1': No such file or directory174 > install: cannot stat './grub-mkrescue.1': No such file or directory175 > install: cannot stat './grub-mkstandalone.1': No such file or directory176 > install: cannot stat './grub-mknetdir.1': No such file or directory177 > install: cannot stat './grub-menulst2cfg.1': No such file or directory178 > install: cannot stat './grub-syslinux2cfg.1': No such file or directory179 > install: cannot stat './grub-glue-efi.1': No such file or directory180 > install: cannot stat './grub-render-label.1': No such file or directory181 > install: cannot stat './grub-file.1': No such file or directory182 > install: cannot stat './grub-kbdcomp.1': No such file or directory183 > make[3]: *** [Makefile:11971: install-man1] Error 1184 > make[3]: Leaving directory '/build/grub'185 > make[2]: *** [Makefile:13273: install-am] Error 2186 > make[2]: Leaving directory '/build/grub'187 > make[1]: *** [Makefile:12168: install-recursive] Error 1188 > make[1]: Leaving directory '/build/grub'189 > make: *** [Makefile:13266: install] Error 2190 For full logs, run:191 nix log /nix/store/4mcrrl6y54hcib7dp4d363iva7k6yhfq-grub-2.12.drv192error: Cannot build '/nix/store/3qj6vqx7yf967sw50vyyq9n6vhjabla2-grub-config.xml.drv'.193 Reason: 1 dependency failed.194 Output paths:195 /nix/store/kn1r9zri52fiv37y2adqqaw2mcqaihna-grub-config.xml196error: Cannot build '/nix/store/xzabm0mclzk8h30mqgh934f1hygfqwww-grub-config.xml.drv'.197 Reason: 1 dependency failed.198 Output paths:199 /nix/store/qs7fwnmhbc2b8bvcqj5kg771hzrkprq4-grub-config.xml200error: Cannot build '/nix/store/vbppqsj43kbszh64azgpr92srvy3zd9b-install-grub.sh.drv'.201 Reason: 2 dependencies failed.202 Output paths:203 /nix/store/0vf0kd3z1pxi3lvaix7j0zbdwrxqax7y-install-grub.sh204error: Cannot build '/nix/store/hhwvazm5y2yhgd2a019ipiw0zg30pqcw-stirling-pdf-2.14.3.drv'.205 Reason: builder failed with exit code 1.206 Output paths:207 /nix/store/6fvk92y01xkia19m7dwybn6hwnq04vww-stirling-pdf-2.14.3208 Last 25 log lines:209 > > Could not resolve org.apache.pdfbox:pdfbox-parent:3.0.8.210 > > Could not parse POM https://repo.maven.apache.org/maven2/org/apache/pdfbox/pdfbox-parent/3.0.8/pdfbox-parent-3.0.8.pom211 > > Content is not allowed in prolog.212 > > Could not resolve org.apache.pdfbox:preflight:3.0.8.213 > Required by:214 > project :common215 > > Could not resolve org.apache.pdfbox:preflight:3.0.8.216 > > Could not parse POM https://repo.maven.apache.org/maven2/org/apache/pdfbox/preflight/3.0.8/preflight-3.0.8.pom217 > > Content is not allowed in prolog.218 > > There is 1 more failure with an identical cause.219 >220 > * Try:221 > > Run with --stacktrace option to get the stack trace.222 > > Run with --info or --debug option to get more log output.223 > > Run with --scan to get full insights.224 > > Get more help at https://help.gradle.org.225 >226 > Deprecated Gradle features were used in this build, making it incompatible with Gradle 9.0.227 >228 > You can use '--warning-mode all' to show the individual deprecation warnings and determine if they come from your own scripts or plugins.229 >230 > For more on this, please refer to https://docs.gradle.org/8.14.4/userguide/command_line_interface.html#sec:command_line_warnings in the Gradle documentation.231 >232 > BUILD FAILED in 26m 29s233 > 5 actionable tasks: 4 executed, 1 up-to-date234 For full logs, run:235 nix log /nix/store/hhwvazm5y2yhgd2a019ipiw0zg30pqcw-stirling-pdf-2.14.3.drv236error: Cannot build '/nix/store/h94bwg8wanqdlvxyq3rhi4fv5lb0wv63-unit-stirling-pdf.service.drv'.237 Reason: 1 dependency failed.238 Output paths:239 /nix/store/zyr703xk7dqq8557qg5rc7c1f5dxy26k-unit-stirling-pdf.service240warning: SQLite database '/nix/var/nix/db/db.sqlite' is busy241error: Cannot build '/nix/store/pp5kjpabq5lbj3csaichni7z7xja0yjk-system-units.drv'.242 Reason: 1 dependency failed.243 Output paths:244 /nix/store/qr78y0znvp6nql4wvv6y6wz8m6vks32z-system-units245error: Cannot build '/nix/store/cy1cws4w1rrdzplv3dm942izihikb30k-etc.drv'.246 Reason: 1 dependency failed.247 Output paths:248 /nix/store/14vp0i4d2kz1w9bzxxfphgjbnjvv5q4c-etc249error: Cannot build '/nix/store/hsjwasjg2z01pl82bh0q5ayw6p4c69xs-activate.drv'.250 Reason: 1 dependency failed.251 Output paths:252 /nix/store/wm77mnbzixk1ybavbnrk63ylhdcpdymr-activate253error: Cannot build '/nix/store/ic8lkfgxskb7n62ais4mgqzbxyhlnksy-nixos-system-nixbox-26.11.20260829.d2f6794.drv'.254 Reason: 3 dependencies failed.255 Output paths:256 /nix/store/3ipd9adkjm7ny2mv69jfzpw93jzz6w76-nixos-system-nixbox-26.11.20260829.d2f6794