stirling-pdf-2.14.3
checks.x86_64-linux.nixos-nixbox
· build #1778
· raw
1structuredAttrs is enabled
unpackPhase
2unpacking source archive /nix/store/sjmwhk983ai834ixyzf91xbbv30qpc06-source3source root is source4unpackPhase completed in 2 minutes 23 secondspatchPhase
5applying patch /nix/store/9351240jw3v702ziz4d0c129yxsc9ip6-remove-props-file-timestamp.patch6patching file build.gradle7Hunk #1 succeeded at 158 (offset 82 lines).8applying patch /nix/store/cva93kipixqzk0yx6c29ys0ksbfy8vd8-skip-sandbox-incompatible-tests.patch9patching file app/core/src/test/java/stirling/software/SPDF/controller/api/misc/ConfigControllerTest.java10patching file app/proprietary/src/test/java/stirling/software/proprietary/cluster/s3/S3ClientsTest.java11Executing npmConfigHook12/build/source/frontend /build/source13Configuring npm14Validating consistency between /build/source/frontend/package-lock.json and /nix/store/jiaqd3v9cnicxdplh6z9jrlwjwdjhnpr-stirling-pdf-2.14.3-npm-deps/package-lock.json15Setting npm_config_cache to /nix/store/jiaqd3v9cnicxdplh6z9jrlwjwdjhnpr-stirling-pdf-2.14.3-npm-deps16Installing dependencies17npm warn Unknown env config "nodedir". This will stop working in the next major version of npm. See `npm help npmrc` for supported config options.18npm warn Unknown env config "platform". This will stop working in the next major version of npm. See `npm help npmrc` for supported config options.19npm warn Unknown env config "arch". This will stop working in the next major version of npm. See `npm help npmrc` for supported config options.20npm warn deprecated readdir-scoped-modules@1.1.0: This functionality has been moved to @npmcli/fs21npm warn deprecated osenv@0.1.5: This package is no longer supported.22npm warn deprecated inflight@1.0.6: This module is not supported, and leaks memory. Do not use it. Check out lru-cache if you want a good and tested way to coalesce async requests by a key value, which is much more comprehensive and powerful.23npm warn deprecated debuglog@1.0.1: Package no longer supported. Contact Support at https://www.npmjs.com/support for more info.24npm warn deprecated read-package-json@2.1.2: This package is no longer supported. Please use @npmcli/package-json instead.25npm warn deprecated glob@7.2.3: Old versions of glob are not supported, and contain widely publicized security vulnerabilities, which have been fixed in the current version. Please update. Support for old versions may be purchased (at exorbitant rates) by contacting i@izs.me26npm warn deprecated tsconfck@3.1.6: unmaintained27npm warn deprecated read-installed@4.0.3: This package is no longer supported.28npm warn deprecated glob@10.5.0: Old versions of glob are not supported, and contain widely publicized security vulnerabilities, which have been fixed in the current version. Please update. Support for old versions may be purchased (at exorbitant rates) by contacting i@izs.me2930added 1151 packages, and audited 1152 packages in 4m3132291 packages are looking for funding33 run `npm fund` for details3435found 0 vulnerabilities36patching script interpreter paths in node_modules37node_modules/@babel/core/node_modules/semver/bin/semver.js: interpreter directive changed from "#!/usr/bin/env node" to "/nix/store/lfaydgacdyngci7p60s8wwvgdm74fjkx-nodejs-24.19.0/bin/node"38node_modules/@babel/helper-compilation-targets/node_modules/semver/bin/semver.js: interpreter directive changed from "#!/usr/bin/env node" to "/nix/store/lfaydgacdyngci7p60s8wwvgdm74fjkx-nodejs-24.19.0/bin/node"39node_modules/@babel/parser/bin/babel-parser.js: interpreter directive changed from "#!/usr/bin/env node" to "/nix/store/lfaydgacdyngci7p60s8wwvgdm74fjkx-nodejs-24.19.0/bin/node"40node_modules/@playwright/test/cli.js: interpreter directive changed from "#!/usr/bin/env node" to "/nix/store/lfaydgacdyngci7p60s8wwvgdm74fjkx-nodejs-24.19.0/bin/node"41node_modules/@puppeteer/browsers/lib/cjs/main-cli.js: interpreter directive changed from "#!/usr/bin/env node" to "/nix/store/lfaydgacdyngci7p60s8wwvgdm74fjkx-nodejs-24.19.0/bin/node"42node_modules/@puppeteer/browsers/lib/esm/main-cli.js: interpreter directive changed from "#!/usr/bin/env node" to "/nix/store/lfaydgacdyngci7p60s8wwvgdm74fjkx-nodejs-24.19.0/bin/node"43node_modules/@tauri-apps/cli/tauri.js: interpreter directive changed from "#!/usr/bin/env node" to "/nix/store/lfaydgacdyngci7p60s8wwvgdm74fjkx-nodejs-24.19.0/bin/node"44node_modules/better-opn/node_modules/open/xdg-open: interpreter directive changed from "#!/bin/sh" to "/nix/store/9ipfvwnqp1q8ijnmi5sxvlx9r8w34lw3-bash-5.3p15/bin/sh"45node_modules/better-opn/node_modules/is-docker/cli.js: interpreter directive changed from "#!/usr/bin/env node" to "/nix/store/lfaydgacdyngci7p60s8wwvgdm74fjkx-nodejs-24.19.0/bin/node"46node_modules/@typescript/native-preview/bin/tsgo.js: interpreter directive changed from "#!/usr/bin/env node" to "/nix/store/lfaydgacdyngci7p60s8wwvgdm74fjkx-nodejs-24.19.0/bin/node"47node_modules/license-checker/node_modules/semver/bin/semver: interpreter directive changed from "#!/usr/bin/env node" to "/nix/store/lfaydgacdyngci7p60s8wwvgdm74fjkx-nodejs-24.19.0/bin/node"48node_modules/license-checker/bin/license-checker: interpreter directive changed from "#!/usr/bin/env node" to "/nix/store/lfaydgacdyngci7p60s8wwvgdm74fjkx-nodejs-24.19.0/bin/node"49node_modules/license-checker/scripts/contrib.js: interpreter directive changed from "#!/usr/bin/env node" to "/nix/store/lfaydgacdyngci7p60s8wwvgdm74fjkx-nodejs-24.19.0/bin/node"50node_modules/rollup-plugin-visualizer/dist/bin/cli.js: interpreter directive changed from "#!/usr/bin/env node" to "/nix/store/lfaydgacdyngci7p60s8wwvgdm74fjkx-nodejs-24.19.0/bin/node"51node_modules/glob/dist/esm/bin.mjs: interpreter directive changed from "#!/usr/bin/env node" to "/nix/store/lfaydgacdyngci7p60s8wwvgdm74fjkx-nodejs-24.19.0/bin/node"52node_modules/acorn/bin/acorn: interpreter directive changed from "#!/usr/bin/env node" to "/nix/store/lfaydgacdyngci7p60s8wwvgdm74fjkx-nodejs-24.19.0/bin/node"53node_modules/ajv/scripts/info: interpreter directive changed from "#!/usr/bin/env node" to "/nix/store/lfaydgacdyngci7p60s8wwvgdm74fjkx-nodejs-24.19.0/bin/node"54node_modules/ajv/scripts/prepare-tests: interpreter directive changed from "#!/usr/bin/env sh" to "/nix/store/9ipfvwnqp1q8ijnmi5sxvlx9r8w34lw3-bash-5.3p15/bin/sh"55node_modules/ajv/scripts/publish-built-version: interpreter directive changed from "#!/usr/bin/env bash" to "/nix/store/9ipfvwnqp1q8ijnmi5sxvlx9r8w34lw3-bash-5.3p15/bin/bash"56node_modules/ajv/scripts/travis-gh-pages: interpreter directive changed from "#!/usr/bin/env bash" to "/nix/store/9ipfvwnqp1q8ijnmi5sxvlx9r8w34lw3-bash-5.3p15/bin/bash"57node_modules/autoprefixer/bin/autoprefixer: interpreter directive changed from "#!/usr/bin/env node" to "/nix/store/lfaydgacdyngci7p60s8wwvgdm74fjkx-nodejs-24.19.0/bin/node"58node_modules/baseline-browser-mapping/dist/cli.cjs: interpreter directive changed from "#!/usr/bin/env node" to "/nix/store/lfaydgacdyngci7p60s8wwvgdm74fjkx-nodejs-24.19.0/bin/node"59node_modules/browserslist/cli.js: interpreter directive changed from "#!/usr/bin/env node" to "/nix/store/lfaydgacdyngci7p60s8wwvgdm74fjkx-nodejs-24.19.0/bin/node"60node_modules/cssesc/bin/cssesc: interpreter directive changed from "#!/usr/bin/env node" to "/nix/store/lfaydgacdyngci7p60s8wwvgdm74fjkx-nodejs-24.19.0/bin/node"61node_modules/d3-dsv/bin/dsv2dsv.js: interpreter directive changed from "#!/usr/bin/env node" to "/nix/store/lfaydgacdyngci7p60s8wwvgdm74fjkx-nodejs-24.19.0/bin/node"62node_modules/d3-dsv/bin/dsv2json.js: interpreter directive changed from "#!/usr/bin/env node" to "/nix/store/lfaydgacdyngci7p60s8wwvgdm74fjkx-nodejs-24.19.0/bin/node"63node_modules/d3-dsv/bin/json2dsv.js: interpreter directive changed from "#!/usr/bin/env node" to "/nix/store/lfaydgacdyngci7p60s8wwvgdm74fjkx-nodejs-24.19.0/bin/node"64node_modules/esbuild/bin/esbuild: interpreter directive changed from "#!/usr/bin/env node" to "/nix/store/lfaydgacdyngci7p60s8wwvgdm74fjkx-nodejs-24.19.0/bin/node"65node_modules/esprima/bin/esparse.js: interpreter directive changed from "#!/usr/bin/env node" to "/nix/store/lfaydgacdyngci7p60s8wwvgdm74fjkx-nodejs-24.19.0/bin/node"66node_modules/esprima/bin/esvalidate.js: interpreter directive changed from "#!/usr/bin/env node" to "/nix/store/lfaydgacdyngci7p60s8wwvgdm74fjkx-nodejs-24.19.0/bin/node"67node_modules/eslint/bin/eslint.js: interpreter directive changed from "#!/usr/bin/env node" to "/nix/store/lfaydgacdyngci7p60s8wwvgdm74fjkx-nodejs-24.19.0/bin/node"68node_modules/is-docker/cli.js: interpreter directive changed from "#!/usr/bin/env node" to "/nix/store/lfaydgacdyngci7p60s8wwvgdm74fjkx-nodejs-24.19.0/bin/node"69node_modules/is-inside-container/cli.js: interpreter directive changed from "#!/usr/bin/env node" to "/nix/store/lfaydgacdyngci7p60s8wwvgdm74fjkx-nodejs-24.19.0/bin/node"70node_modules/jiti/lib/jiti-cli.mjs: interpreter directive changed from "#!/usr/bin/env node" to "/nix/store/lfaydgacdyngci7p60s8wwvgdm74fjkx-nodejs-24.19.0/bin/node"71node_modules/js-yaml/bin/js-yaml.js: interpreter directive changed from "#!/usr/bin/env node" to "/nix/store/lfaydgacdyngci7p60s8wwvgdm74fjkx-nodejs-24.19.0/bin/node"72node_modules/jsesc/bin/jsesc: interpreter directive changed from "#!/usr/bin/env node" to "/nix/store/lfaydgacdyngci7p60s8wwvgdm74fjkx-nodejs-24.19.0/bin/node"73node_modules/json5/lib/cli.js: interpreter directive changed from "#!/usr/bin/env node" to "/nix/store/lfaydgacdyngci7p60s8wwvgdm74fjkx-nodejs-24.19.0/bin/node"74node_modules/license-report/index.js: interpreter directive changed from "#!/usr/bin/env node" to "/nix/store/lfaydgacdyngci7p60s8wwvgdm74fjkx-nodejs-24.19.0/bin/node"75node_modules/loose-envify/cli.js: interpreter directive changed from "#!/usr/bin/env node" to "/nix/store/lfaydgacdyngci7p60s8wwvgdm74fjkx-nodejs-24.19.0/bin/node"76node_modules/lz-string/bin/bin.js: interpreter directive changed from "#! /usr/bin/env node" to "/nix/store/lfaydgacdyngci7p60s8wwvgdm74fjkx-nodejs-24.19.0/bin/node"77node_modules/nanoid/bin/nanoid.cjs: interpreter directive changed from "#!/usr/bin/env node" to "/nix/store/lfaydgacdyngci7p60s8wwvgdm74fjkx-nodejs-24.19.0/bin/node"78node_modules/mkdirp/bin/cmd.js: interpreter directive changed from "#!/usr/bin/env node" to "/nix/store/lfaydgacdyngci7p60s8wwvgdm74fjkx-nodejs-24.19.0/bin/node"79node_modules/nopt/bin/nopt.js: interpreter directive changed from "#!/usr/bin/env node" to "/nix/store/lfaydgacdyngci7p60s8wwvgdm74fjkx-nodejs-24.19.0/bin/node"80node_modules/open/xdg-open: interpreter directive changed from "#!/bin/sh" to "/nix/store/9ipfvwnqp1q8ijnmi5sxvlx9r8w34lw3-bash-5.3p15/bin/sh"81node_modules/pixelmatch/bin/pixelmatch: interpreter directive changed from "#!/usr/bin/env node" to "/nix/store/lfaydgacdyngci7p60s8wwvgdm74fjkx-nodejs-24.19.0/bin/node"82node_modules/playwright/cli.js: interpreter directive changed from "#!/usr/bin/env node" to "/nix/store/lfaydgacdyngci7p60s8wwvgdm74fjkx-nodejs-24.19.0/bin/node"83node_modules/playwright-core/lib/utilsBundleImpl/xdg-open: interpreter directive changed from "#!/bin/sh" to "/nix/store/9ipfvwnqp1q8ijnmi5sxvlx9r8w34lw3-bash-5.3p15/bin/sh"84node_modules/playwright-core/cli.js: interpreter directive changed from "#!/usr/bin/env node" to "/nix/store/lfaydgacdyngci7p60s8wwvgdm74fjkx-nodejs-24.19.0/bin/node"85node_modules/playwright-core/bin/reinstall_chrome_beta_linux.sh: interpreter directive changed from "#!/usr/bin/env bash" to "/nix/store/9ipfvwnqp1q8ijnmi5sxvlx9r8w34lw3-bash-5.3p15/bin/bash"86node_modules/playwright-core/bin/reinstall_chrome_beta_mac.sh: interpreter directive changed from "#!/usr/bin/env bash" to "/nix/store/9ipfvwnqp1q8ijnmi5sxvlx9r8w34lw3-bash-5.3p15/bin/bash"87node_modules/playwright-core/bin/reinstall_chrome_stable_linux.sh: interpreter directive changed from "#!/usr/bin/env bash" to "/nix/store/9ipfvwnqp1q8ijnmi5sxvlx9r8w34lw3-bash-5.3p15/bin/bash"88node_modules/playwright-core/bin/reinstall_chrome_stable_mac.sh: interpreter directive changed from "#!/usr/bin/env bash" to "/nix/store/9ipfvwnqp1q8ijnmi5sxvlx9r8w34lw3-bash-5.3p15/bin/bash"89node_modules/playwright-core/bin/reinstall_msedge_beta_linux.sh: interpreter directive changed from "#!/usr/bin/env bash" to "/nix/store/9ipfvwnqp1q8ijnmi5sxvlx9r8w34lw3-bash-5.3p15/bin/bash"90node_modules/playwright-core/bin/reinstall_msedge_beta_mac.sh: interpreter directive changed from "#!/usr/bin/env bash" to "/nix/store/9ipfvwnqp1q8ijnmi5sxvlx9r8w34lw3-bash-5.3p15/bin/bash"91node_modules/playwright-core/bin/reinstall_msedge_dev_linux.sh: interpreter directive changed from "#!/usr/bin/env bash" to "/nix/store/9ipfvwnqp1q8ijnmi5sxvlx9r8w34lw3-bash-5.3p15/bin/bash"92node_modules/playwright-core/bin/reinstall_msedge_dev_mac.sh: interpreter directive changed from "#!/usr/bin/env bash" to "/nix/store/9ipfvwnqp1q8ijnmi5sxvlx9r8w34lw3-bash-5.3p15/bin/bash"93node_modules/playwright-core/bin/reinstall_msedge_stable_linux.sh: interpreter directive changed from "#!/usr/bin/env bash" to "/nix/store/9ipfvwnqp1q8ijnmi5sxvlx9r8w34lw3-bash-5.3p15/bin/bash"94node_modules/playwright-core/bin/reinstall_msedge_stable_mac.sh: interpreter directive changed from "#!/usr/bin/env bash" to "/nix/store/9ipfvwnqp1q8ijnmi5sxvlx9r8w34lw3-bash-5.3p15/bin/bash"95node_modules/postcss-cli/index.js: interpreter directive changed from "#!/usr/bin/env node" to "/nix/store/lfaydgacdyngci7p60s8wwvgdm74fjkx-nodejs-24.19.0/bin/node"96node_modules/postcss-preset-mantine/.yarn/releases/yarn-4.9.2.cjs: interpreter directive changed from "#!/usr/bin/env node" to "/nix/store/lfaydgacdyngci7p60s8wwvgdm74fjkx-nodejs-24.19.0/bin/node"97node_modules/prettier/bin/prettier.cjs: interpreter directive changed from "#!/usr/bin/env node" to "/nix/store/lfaydgacdyngci7p60s8wwvgdm74fjkx-nodejs-24.19.0/bin/node"98node_modules/react-dropzone/.husky/commit-msg: interpreter directive changed from "#!/bin/sh" to "/nix/store/9ipfvwnqp1q8ijnmi5sxvlx9r8w34lw3-bash-5.3p15/bin/sh"99node_modules/react-dropzone/.husky/pre-commit: interpreter directive changed from "#!/bin/sh" to "/nix/store/9ipfvwnqp1q8ijnmi5sxvlx9r8w34lw3-bash-5.3p15/bin/sh"100node_modules/resolve/bin/resolve: interpreter directive changed from "#!/usr/bin/env node" to "/nix/store/lfaydgacdyngci7p60s8wwvgdm74fjkx-nodejs-24.19.0/bin/node"101node_modules/rollup/dist/bin/rollup: interpreter directive changed from "#!/usr/bin/env node" to "/nix/store/lfaydgacdyngci7p60s8wwvgdm74fjkx-nodejs-24.19.0/bin/node"102node_modules/recast/example/add-braces: interpreter directive changed from "#!/usr/bin/env node" to "/nix/store/lfaydgacdyngci7p60s8wwvgdm74fjkx-nodejs-24.19.0/bin/node"103node_modules/recast/example/generic-identity: interpreter directive changed from "#!/usr/bin/env node" to "/nix/store/lfaydgacdyngci7p60s8wwvgdm74fjkx-nodejs-24.19.0/bin/node"104node_modules/recast/example/identity: interpreter directive changed from "#!/usr/bin/env node" to "/nix/store/lfaydgacdyngci7p60s8wwvgdm74fjkx-nodejs-24.19.0/bin/node"105node_modules/recast/example/to-while: interpreter directive changed from "#!/usr/bin/env node" to "/nix/store/lfaydgacdyngci7p60s8wwvgdm74fjkx-nodejs-24.19.0/bin/node"106node_modules/rw/test/encoding-sync: interpreter directive changed from "#!/usr/bin/env node" to "/nix/store/lfaydgacdyngci7p60s8wwvgdm74fjkx-nodejs-24.19.0/bin/node"107node_modules/rw/test/cat-async: interpreter directive changed from "#!/usr/bin/env node" to "/nix/store/lfaydgacdyngci7p60s8wwvgdm74fjkx-nodejs-24.19.0/bin/node"108node_modules/rw/test/encode-object-async: interpreter directive changed from "#!/usr/bin/env node" to "/nix/store/lfaydgacdyngci7p60s8wwvgdm74fjkx-nodejs-24.19.0/bin/node"109node_modules/rw/test/encode-object-sync: interpreter directive changed from "#!/usr/bin/env node" to "/nix/store/lfaydgacdyngci7p60s8wwvgdm74fjkx-nodejs-24.19.0/bin/node"110node_modules/rw/test/encode-string-async: interpreter directive changed from "#!/usr/bin/env node" to "/nix/store/lfaydgacdyngci7p60s8wwvgdm74fjkx-nodejs-24.19.0/bin/node"111node_modules/rw/test/encode-string-sync: interpreter directive changed from "#!/usr/bin/env node" to "/nix/store/lfaydgacdyngci7p60s8wwvgdm74fjkx-nodejs-24.19.0/bin/node"112node_modules/rw/test/encoding-async: interpreter directive changed from "#!/usr/bin/env node" to "/nix/store/lfaydgacdyngci7p60s8wwvgdm74fjkx-nodejs-24.19.0/bin/node"113node_modules/rw/test/cat-sync: interpreter directive changed from "#!/usr/bin/env node" to "/nix/store/lfaydgacdyngci7p60s8wwvgdm74fjkx-nodejs-24.19.0/bin/node"114node_modules/rw/test/run-tests: interpreter directive changed from "#!/bin/bash" to "/nix/store/9ipfvwnqp1q8ijnmi5sxvlx9r8w34lw3-bash-5.3p15/bin/bash"115node_modules/rw/test/wc-async: interpreter directive changed from "#!/usr/bin/env node" to "/nix/store/lfaydgacdyngci7p60s8wwvgdm74fjkx-nodejs-24.19.0/bin/node"116node_modules/rw/test/wc-sync: interpreter directive changed from "#!/usr/bin/env node" to "/nix/store/lfaydgacdyngci7p60s8wwvgdm74fjkx-nodejs-24.19.0/bin/node"117node_modules/rw/test/write-async: interpreter directive changed from "#!/usr/bin/env node" to "/nix/store/lfaydgacdyngci7p60s8wwvgdm74fjkx-nodejs-24.19.0/bin/node"118node_modules/rw/test/write-sync: interpreter directive changed from "#!/usr/bin/env node" to "/nix/store/lfaydgacdyngci7p60s8wwvgdm74fjkx-nodejs-24.19.0/bin/node"119node_modules/semver/bin/semver.js: interpreter directive changed from "#!/usr/bin/env node" to "/nix/store/lfaydgacdyngci7p60s8wwvgdm74fjkx-nodejs-24.19.0/bin/node"120node_modules/storybook/node_modules/esbuild/bin/esbuild: interpreter directive changed from "#!/usr/bin/env node" to "/nix/store/lfaydgacdyngci7p60s8wwvgdm74fjkx-nodejs-24.19.0/bin/node"121node_modules/storybook/bin/index.cjs: interpreter directive changed from "#!/usr/bin/env node" to "/nix/store/lfaydgacdyngci7p60s8wwvgdm74fjkx-nodejs-24.19.0/bin/node"122node_modules/tldts/bin/cli.js: interpreter directive changed from "#!/usr/bin/env node" to "/nix/store/lfaydgacdyngci7p60s8wwvgdm74fjkx-nodejs-24.19.0/bin/node"123node_modules/treeify/examples/fs_tree.js: interpreter directive changed from "#!/usr/bin/env node" to "/nix/store/lfaydgacdyngci7p60s8wwvgdm74fjkx-nodejs-24.19.0/bin/node"124node_modules/tsx/dist/cli.mjs: interpreter directive changed from "#!/usr/bin/env node" to "/nix/store/lfaydgacdyngci7p60s8wwvgdm74fjkx-nodejs-24.19.0/bin/node"125node_modules/typescript/bin/tsc: interpreter directive changed from "#!/usr/bin/env node" to "/nix/store/lfaydgacdyngci7p60s8wwvgdm74fjkx-nodejs-24.19.0/bin/node"126node_modules/typescript/bin/tsserver: interpreter directive changed from "#!/usr/bin/env node" to "/nix/store/lfaydgacdyngci7p60s8wwvgdm74fjkx-nodejs-24.19.0/bin/node"127node_modules/vite/bin/vite.js: interpreter directive changed from "#!/usr/bin/env node" to "/nix/store/lfaydgacdyngci7p60s8wwvgdm74fjkx-nodejs-24.19.0/bin/node"128node_modules/vite-node/vite-node.mjs: interpreter directive changed from "#!/usr/bin/env node" to "/nix/store/lfaydgacdyngci7p60s8wwvgdm74fjkx-nodejs-24.19.0/bin/node"129node_modules/vitest/vitest.mjs: interpreter directive changed from "#!/usr/bin/env node" to "/nix/store/lfaydgacdyngci7p60s8wwvgdm74fjkx-nodejs-24.19.0/bin/node"130node_modules/update-browserslist-db/cli.js: interpreter directive changed from "#!/usr/bin/env node" to "/nix/store/lfaydgacdyngci7p60s8wwvgdm74fjkx-nodejs-24.19.0/bin/node"131node_modules/which/bin/node-which: interpreter directive changed from "#!/usr/bin/env node" to "/nix/store/lfaydgacdyngci7p60s8wwvgdm74fjkx-nodejs-24.19.0/bin/node"132node_modules/why-is-node-running/cli.js: interpreter directive changed from "#!/usr/bin/env node" to "/nix/store/lfaydgacdyngci7p60s8wwvgdm74fjkx-nodejs-24.19.0/bin/node"133node_modules/yaml/bin.mjs: interpreter directive changed from "#!/usr/bin/env node" to "/nix/store/lfaydgacdyngci7p60s8wwvgdm74fjkx-nodejs-24.19.0/bin/node"134node_modules/dpdm/node_modules/typescript/bin/tsc: interpreter directive changed from "#!/usr/bin/env node" to "/nix/store/lfaydgacdyngci7p60s8wwvgdm74fjkx-nodejs-24.19.0/bin/node"135node_modules/dpdm/node_modules/typescript/bin/tsserver: interpreter directive changed from "#!/usr/bin/env node" to "/nix/store/lfaydgacdyngci7p60s8wwvgdm74fjkx-nodejs-24.19.0/bin/node"136node_modules/dpdm/lib/bin/dpdm.js: interpreter directive changed from "#!/usr/bin/env node" to "/nix/store/lfaydgacdyngci7p60s8wwvgdm74fjkx-nodejs-24.19.0/bin/node"137node_modules/escodegen/bin/escodegen.js: interpreter directive changed from "#!/usr/bin/env node" to "/nix/store/lfaydgacdyngci7p60s8wwvgdm74fjkx-nodejs-24.19.0/bin/node"138node_modules/escodegen/bin/esgenerate.js: interpreter directive changed from "#!/usr/bin/env node" to "/nix/store/lfaydgacdyngci7p60s8wwvgdm74fjkx-nodejs-24.19.0/bin/node"139node_modules/extract-zip/cli.js: interpreter directive changed from "#!/usr/bin/env node" to "/nix/store/lfaydgacdyngci7p60s8wwvgdm74fjkx-nodejs-24.19.0/bin/node"140node_modules/normalize-package-data/node_modules/semver/bin/semver: interpreter directive changed from "#!/usr/bin/env node" to "/nix/store/lfaydgacdyngci7p60s8wwvgdm74fjkx-nodejs-24.19.0/bin/node"141node_modules/msw/cli/index.js: interpreter directive changed from "#!/usr/bin/env node" to "/nix/store/lfaydgacdyngci7p60s8wwvgdm74fjkx-nodejs-24.19.0/bin/node"142node_modules/puppeteer/lib/cjs/puppeteer/node/cli.js: interpreter directive changed from "#!/usr/bin/env node" to "/nix/store/lfaydgacdyngci7p60s8wwvgdm74fjkx-nodejs-24.19.0/bin/node"143node_modules/puppeteer/lib/esm/puppeteer/node/cli.js: interpreter directive changed from "#!/usr/bin/env node" to "/nix/store/lfaydgacdyngci7p60s8wwvgdm74fjkx-nodejs-24.19.0/bin/node"144node_modules/puppeteer/install.mjs: interpreter directive changed from "#!/usr/bin/env node" to "/nix/store/lfaydgacdyngci7p60s8wwvgdm74fjkx-nodejs-24.19.0/bin/node"145node_modules/read-installed/node_modules/semver/bin/semver: interpreter directive changed from "#!/usr/bin/env node" to "/nix/store/lfaydgacdyngci7p60s8wwvgdm74fjkx-nodejs-24.19.0/bin/node"146node_modules/rc/cli.js: interpreter directive changed from "#! /usr/bin/env node" to "/nix/store/lfaydgacdyngci7p60s8wwvgdm74fjkx-nodejs-24.19.0/bin/node"147node_modules/vite-tsconfig-paths/node_modules/tsconfck/bin/tsconfck.js: interpreter directive changed from "#!/usr/bin/env node" to "/nix/store/lfaydgacdyngci7p60s8wwvgdm74fjkx-nodejs-24.19.0/bin/node"148npm warn Unknown env config "nodedir". This will stop working in the next major version of npm. See `npm help npmrc` for supported config options.149npm warn Unknown env config "platform". This will stop working in the next major version of npm. See `npm help npmrc` for supported config options.150npm warn Unknown env config "arch". This will stop working in the next major version of npm. See `npm help npmrc` for supported config options.151npm warn rebuild 7 packages have install scripts not yet covered by allowScripts. Run `npm approve-scripts --allow-scripts-pending` to review.152rebuilt dependencies successfully153patching script interpreter paths in node_modules154~/source155Finished npmConfigHook156patchPhase completed in 4 minutes 53 secondsconfigurePhase
157~/tmp.H1Iwro33XF ~/source158~/source159Certificate was added to keystore160no configure script, doing nothingbuildPhase
161162Welcome to Gradle 8.14.4!163164Here are the highlights of this release:165 - Java 24 support166 - GraalVM Native Image toolchain selection167 - Enhancements to test reporting168 - Build Authoring improvements169170For more details see https://docs.gradle.org/8.14.4/release-notes.html171172To honour the JVM settings for this build a single-use Daemon process will be forked. For more on this, please refer to https://docs.gradle.org/8.14.4/userguide/gradle_daemon.html#sec:disabling_the_daemon in the Gradle documentation.173Daemon will be stopped at the end of the build 174175> Configure project :176No custom MAVEN_PUBLIC_URL set, defaulting to Maven Central177Writing version.properties to /build/source/app/common/src/main/resources/version.properties178179> Configure project :common180JPDFium native platforms: linux-x64, linux-arm64, darwin-x64, darwin-arm64, windows-x64181182> Configure project :stirling-pdf183Editor frontend build enabled - JAR will include React frontend (mode=proprietary)184[Fatal Error] preflight-3.0.8.pom:1:44: Content is not allowed in prolog.185[Fatal Error] pdfbox-parent-3.0.8.pom:1:44: Content is not allowed in prolog.186[Fatal Error] pdfbox-io-3.0.8.pom:1:44: Content is not allowed in prolog.187[Fatal Error] pdfbox-3.0.8.pom:1:44: Content is not allowed in prolog.188[Fatal Error] protocol-core-2.44.12.pom:1:44: Content is not allowed in prolog.189[Fatal Error] protocols-2.44.12.pom:1:44: Content is not allowed in prolog.190[Fatal Error] profiles-2.44.12.pom:1:44: Content is not allowed in prolog.191[Fatal Error] preflight-3.0.8.pom:1:44: Content is not allowed in prolog.192[Fatal Error] pdfbox-parent-3.0.8.pom:1:44: Content is not allowed in prolog.193[Fatal Error] pdfbox-io-3.0.8.pom:1:44: Content is not allowed in prolog.194[Fatal Error] pdfbox-3.0.8.pom:1:44: Content is not allowed in prolog.195[Fatal Error] profiles-2.44.12.pom:1:44: Content is not allowed in prolog.196[Fatal Error] protocols-2.44.12.pom:1:44: Content is not allowed in prolog.197[Fatal Error] protocol-core-2.44.12.pom:1:44: Content is not allowed in prolog.198[Fatal Error] preflight-3.0.8.pom:1:44: Content is not allowed in prolog.199[Fatal Error] pdfbox-3.0.8.pom:1:44: Content is not allowed in prolog.200[Fatal Error] pdfbox-parent-3.0.8.pom:1:44: Content is not allowed in prolog.201[Fatal Error] pdfbox-io-3.0.8.pom:1:44: Content is not allowed in prolog.202[Fatal Error] preflight-3.0.8.pom:1:44: Content is not allowed in prolog.203[Fatal Error] pdfbox-parent-3.0.8.pom:1:44: Content is not allowed in prolog.204[Fatal Error] pdfbox-3.0.8.pom:1:44: Content is not allowed in prolog.205[Fatal Error] pdfbox-io-3.0.8.pom:1:44: Content is not allowed in prolog.206[Fatal Error] protocol-core-2.44.12.pom:1:44: Content is not allowed in prolog.207[Fatal Error] profiles-2.44.12.pom:1:44: Content is not allowed in prolog.208[Fatal Error] protocols-2.44.12.pom:1:44: Content is not allowed in prolog.209[Fatal Error] pdfbox-3.0.8.pom:1:44: Content is not allowed in prolog.210[Fatal Error] pdfbox-io-3.0.8.pom:1:44: Content is not allowed in prolog.211[Fatal Error] preflight-3.0.8.pom:1:44: Content is not allowed in prolog.212[Fatal Error] pdfbox-parent-3.0.8.pom:1:44: Content is not allowed in prolog.213[Fatal Error] protocol-core-2.44.12.pom:1:44: Content is not allowed in prolog.214[Fatal Error] profiles-2.44.12.pom:1:44: Content is not allowed in prolog.215[Fatal Error] protocols-2.44.12.pom:1:44: Content is not allowed in prolog.216[Fatal Error] pdfbox-io-3.0.8.pom:1:44: Content is not allowed in prolog.217[Fatal Error] preflight-3.0.8.pom:1:44: Content is not allowed in prolog.218[Fatal Error] pdfbox-parent-3.0.8.pom:1:44: Content is not allowed in prolog.219[Fatal Error] pdfbox-3.0.8.pom:1:44: Content is not allowed in prolog.220[Fatal Error] pdfbox-3.0.8.pom:1:44: Content is not allowed in prolog.221[Fatal Error] pdfbox-io-3.0.8.pom:1:44: Content is not allowed in prolog.222[Fatal Error] pdfbox-parent-3.0.8.pom:1:44: Content is not allowed in prolog.223[Fatal Error] preflight-3.0.8.pom:1:44: Content is not allowed in prolog.224[Fatal Error] protocol-core-2.44.12.pom:1:44: Content is not allowed in prolog.225[Fatal Error] profiles-2.44.12.pom:1:44: Content is not allowed in prolog.226[Fatal Error] protocols-2.44.12.pom:1:44: Content is not allowed in prolog.227[Fatal Error] preflight-3.0.8.pom:1:44: Content is not allowed in prolog.228[Fatal Error] pdfbox-parent-3.0.8.pom:1:44: Content is not allowed in prolog.229[Fatal Error] pdfbox-3.0.8.pom:1:44: Content is not allowed in prolog.230[Fatal Error] pdfbox-io-3.0.8.pom:1:44: Content is not allowed in prolog.231[Fatal Error] profiles-2.44.12.pom:1:44: Content is not allowed in prolog.232[Fatal Error] protocol-core-2.44.12.pom:1:44: Content is not allowed in prolog.233[Fatal Error] protocols-2.44.12.pom:1:44: Content is not allowed in prolog.234235> Task :stirling-pdf:cleanFrontendAssets UP-TO-DATE236> Task :writeVersion237> Task :processResources NO-SOURCE238> Task :proprietary:processResources239240> Task :stirling-pdf:npmBuild241Building editor frontend application for production (mode=proprietary, VITE_API_BASE_URL=/)242task: [frontend:install] npm install243task: [frontend:prepare:og] node editor/scripts/generate-og-metadata.mjs244[frontend:prepare:og] Wrote src/core/data/ogImageMap.json (58 tools with art)245[frontend:prepare:og] Wrote public/og-metadata.json (152 paths)246[frontend:prepare:og] 247[frontend:prepare:og] Tools with OG image: 58/59248[frontend:prepare:og] Tools using the DEFAULT image (home.png) - no bespoke art: 1249[frontend:prepare:og] regular sharedSign /shared-sign250[frontend:prepare:og] 251[frontend:prepare:og] Unused images in public/og_images (7): auto-split-by-size-count, auto-split-pages, manage-certificates, split-by-chapters, split-by-sections, splitPdf, view-pdf252253> Task :common:compileJava FAILED254[Fatal Error] pdfbox-3.0.8.pom:1:44: Content is not allowed in prolog.255[Fatal Error] pdfbox-io-3.0.8.pom:1:44: Content is not allowed in prolog.256[Fatal Error] preflight-3.0.8.pom:1:44: Content is not allowed in prolog.257[Fatal Error] pdfbox-parent-3.0.8.pom:1:44: Content is not allowed in prolog.258259> Task :stirling-pdf:npmBuild260[frontend:install] npm warn Unknown env config "arch". This will stop working in the next major version of npm. See `npm help npmrc` for supported config options.261[frontend:install] npm warn Unknown env config "nodedir". This will stop working in the next major version of npm. See `npm help npmrc` for supported config options.262[frontend:install] npm warn Unknown env config "platform". This will stop working in the next major version of npm. See `npm help npmrc` for supported config options.263[frontend:install] 264[frontend:install] up to date, audited 1152 packages in 33s265[frontend:install] 266[frontend:install] 291 packages are looking for funding267[frontend:install] run `npm fund` for details268[frontend:install] 269[frontend:install] found 0 vulnerabilities270[frontend:install] npm warn allow-scripts 7 packages have install scripts not yet covered by allowScripts:271[frontend:install] npm warn allow-scripts @swc/core@1.15.21 (postinstall: node postinstall.js)272[frontend:install] npm warn allow-scripts core-js@3.49.0 (postinstall: node -e "try{require('./postinstall')}catch(e){}")273[frontend:install] npm warn allow-scripts esbuild@0.27.4 (postinstall: node install.js)274[frontend:install] npm warn allow-scripts msw@2.14.6 (postinstall: node -e "import('./config/scripts/postinstall.js').catch(() => void 0)")275[frontend:install] npm warn allow-scripts protobufjs@7.6.0 (postinstall: node scripts/postinstall)276[frontend:install] npm warn allow-scripts puppeteer@24.40.0 (postinstall: node install.mjs)277[frontend:install] npm warn allow-scripts esbuild@0.25.12 (postinstall: node install.js)278[frontend:install] npm warn allow-scripts279[frontend:install] npm warn allow-scripts Run `npm approve-scripts --allow-scripts-pending` to review, or `npm approve-scripts <pkg>` to allow.280task: [frontend:prepare:icons] node editor/scripts/generate-icons.js281task: [frontend:prepare:env] npx tsx editor/scripts/setup-env.mts282[frontend:prepare:icons] 🔍 Scanning codebase for LocalIcon usage...283[frontend:prepare:icons] 📋 Found 196 unique icons across codebase284[frontend:prepare:icons] 🔍 Extracting 196 icons from Material Symbols...285[frontend:prepare:icons] ✅ Successfully extracted 196 icons286[frontend:prepare:icons] 📦 Bundle size: 82KB287[frontend:prepare:icons] 💾 Saved to: /build/source/frontend/editor/src/assets/material-symbols-icons.json288[frontend:prepare:icons] 📝 Generated types: /build/source/frontend/editor/src/assets/material-symbols-icons.d.ts289[frontend:prepare:icons] 🎉 Icon extraction complete!290[frontend:prepare:env] npm warn Unknown env config "arch". This will stop working in the next major version of npm. See `npm help npmrc` for supported config options.291[frontend:prepare:env] npm warn Unknown env config "nodedir". This will stop working in the next major version of npm. See `npm help npmrc` for supported config options.292[frontend:prepare:env] npm warn Unknown env config "platform". This will stop working in the next major version of npm. See `npm help npmrc` for supported config options.293[frontend:prepare:env] setup-env: created empty .env.local for local overrides294task: [frontend:build:proprietary] npx vite build editor --mode proprietary295[frontend:build:proprietary] npm warn Unknown env config "arch". This will stop working in the next major version of npm. See `npm help npmrc` for supported config options.296[frontend:build:proprietary] npm warn Unknown env config "nodedir". This will stop working in the next major version of npm. See `npm help npmrc` for supported config options.297[frontend:build:proprietary] npm warn Unknown env config "platform". This will stop working in the next major version of npm. See `npm help npmrc` for supported config options.298[frontend:build:proprietary] vite v7.3.2 building client environment for proprietary...299[frontend:build:proprietary] transforming...300[frontend:build:proprietary] ✓ 3981 modules transformed.301[frontend:build:proprietary] rendering chunks...302[frontend:build:proprietary] [plugin vite:reporter] 303[frontend:build:proprietary] (!) /build/source/frontend/editor/src/core/utils/thumbnailUtils.ts is dynamically imported by /build/source/frontend/editor/src/core/contexts/file/fileActions.ts but also statically imported by /build/source/frontend/editor/src/core/components/shared/FileSelectorPicker.tsx, /build/source/frontend/editor/src/core/contexts/IndexedDBContext.tsx, /build/source/frontend/editor/src/core/contexts/file/fileActions.ts, /build/source/frontend/editor/src/core/hooks/tools/shared/useToolResources.ts, /build/source/frontend/editor/src/core/hooks/useIndexedDBThumbnail.ts, /build/source/frontend/editor/src/core/hooks/useLazyThumbnail.ts, /build/source/frontend/editor/src/core/services/zipFileService.ts, /build/source/frontend/editor/src/core/utils/signatureFlattening.ts, dynamic import will not move module into another chunk.304[frontend:build:proprietary] 305[frontend:build:proprietary] [plugin vite:reporter] 306[frontend:build:proprietary] (!) /build/source/frontend/node_modules/jszip/dist/jszip.min.js?commonjs-es-import is dynamically imported by /build/source/frontend/editor/src/core/components/pageEditor/hooks/usePageEditorExport.ts, /build/source/frontend/editor/src/core/hooks/tools/ocr/useOCROperation.ts but also statically imported by /build/source/frontend/editor/src/core/services/serverStorageBundle.ts, /build/source/frontend/editor/src/core/services/shareBundleUtils.ts, /build/source/frontend/editor/src/core/services/zipFileService.ts, /build/source/frontend/editor/src/proprietary/components/watchedFolders/WatchedFolderWorkbenchView.tsx, dynamic import will not move module into another chunk.307[frontend:build:proprietary] 308[frontend:build:proprietary] [plugin vite:reporter] 309[frontend:build:proprietary] (!) /build/source/frontend/editor/src/core/services/pendingFilePathMappings.ts is dynamically imported by /build/source/frontend/editor/src/core/contexts/file/fileActions.ts but also statically imported by /build/source/frontend/editor/src/core/contexts/FileManagerContext.tsx, /build/source/frontend/editor/src/core/services/openFilesFromDisk.ts, dynamic import will not move module into another chunk.310[frontend:build:proprietary] 311[frontend:build:proprietary] computing gzip size...312[frontend:build:proprietary] [vite-plugin-static-copy] Copied 210 items.313[frontend:build:proprietary] dist/assets/AddPasswordSettings-BAHyvnTp.js.br 0.46 kB314[frontend:build:proprietary] dist/assets/ChangeMetadataSingleStep-y6vBqYAs.js.br 0.46 kB315[frontend:build:proprietary] dist/assets/FlattenSettings-DWJsZVxh.js.br 0.49 kB316[frontend:build:proprietary] dist/assets/ButtonSelector-C-oVwO0F.js.br 0.50 kB317[frontend:build:proprietary] dist/assets/ExtractImages-izgJURDD.js.br 0.52 kB318[frontend:build:proprietary] dist/assets/ScannerImageSplitSettings-BB9Pvcvh.js.br 0.53 kB319[frontend:build:proprietary] dist/assets/signaturePreview-B95QiOc8.js.br 0.53 kB320[frontend:build:proprietary] dist/assets/ChangeMetadataSingleStep-y6vBqYAs.js.gz 0.53 kB321[frontend:build:proprietary] dist/assets/AddPasswordSettings-BAHyvnTp.js.gz 0.54 kB322[frontend:build:proprietary] dist/assets/Sanitize-BvRY6Wjx.js.br 0.54 kB323[frontend:build:proprietary] dist/assets/usePageSelectionTips-BWconWbz.js.br 0.55 kB324[frontend:build:proprietary] dist/assets/RemoveBlanksSettings-DXS1kW8y.js.br 0.56 kB325[frontend:build:proprietary] dist/assets/AddPageNumbersAppearanceSettings-Bc95VS3p.css.br 0.57 kB326[frontend:build:proprietary] dist/assets/ButtonSelector-C-oVwO0F.js.gz 0.58 kB327[frontend:build:proprietary] dist/assets/AdjustPageScaleSettings-Sfss_fMC.js.br 0.58 kB328[frontend:build:proprietary] dist/assets/PageSelectionSyntaxHint-BkZlj5B4.js.br 0.59 kB329[frontend:build:proprietary] dist/assets/signaturePreview-B95QiOc8.js.gz 0.60 kB330[frontend:build:proprietary] dist/assets/FlattenSettings-DWJsZVxh.js.gz 0.61 kB331[frontend:build:proprietary] dist/assets/CropCoordinateInputs-DorMFtsv.js.br 0.61 kB332[frontend:build:proprietary] dist/assets/use-move-CmntEdrY.js.br 0.61 kB333[frontend:build:proprietary] dist/assets/RemoveAnnotations-D9_YCXIR.js.br 0.62 kB334[frontend:build:proprietary] dist/assets/ExtractImages-izgJURDD.js.gz 0.62 kB335[frontend:build:proprietary] dist/assets/Sanitize-BvRY6Wjx.js.gz 0.63 kB336[frontend:build:proprietary] dist/assets/ScannerImageSplitSettings-BB9Pvcvh.js.gz 0.64 kB337[frontend:build:proprietary] dist/assets/RemovePassword-DDRu-leo.js.br 0.65 kB338[frontend:build:proprietary] dist/assets/styles-BaSic968.css.br 0.65 kB339[frontend:build:proprietary] dist/assets/usePageSelectionTips-BWconWbz.js.gz 0.65 kB340[frontend:build:proprietary] dist/assets/RemoveBlanksSettings-DXS1kW8y.js.gz 0.65 kB341[frontend:build:proprietary] dist/assets/ShowJS-DZ9Eyz-s.css.br 0.66 kB342[frontend:build:proprietary] dist/assets/AutoRename-OGE7jVx1.js.br 0.66 kB343[frontend:build:proprietary] dist/assets/ExtractPages-CILQjW3B.js.br 0.67 kB344[frontend:build:proprietary] dist/assets/PageSelectionSyntaxHint-BkZlj5B4.js.gz 0.68 kB345[frontend:build:proprietary] dist/assets/useBaseTool-BykdGST-.js.br 0.68 kB346[frontend:build:proprietary] dist/assets/ChangePermissions-DQOCEEI8.js.br 0.68 kB347[frontend:build:proprietary] dist/assets/AdjustPageScaleSettings-Sfss_fMC.js.gz 0.69 kB348[frontend:build:proprietary] dist/assets/use-move-CmntEdrY.js.gz 0.70 kB349[frontend:build:proprietary] dist/assets/List-BeJ2XdrD.js.br 0.70 kB350[frontend:build:proprietary] dist/assets/ReplaceColorSettings-l2SYI_Pm.js.br 0.72 kB351[frontend:build:proprietary] dist/assets/AddPageNumbersAppearanceSettings-Bc95VS3p.css.gz 0.73 kB352[frontend:build:proprietary] dist/assets/RemoveAnnotations-D9_YCXIR.js.gz 0.73 kB353[frontend:build:proprietary] dist/assets/CropCoordinateInputs-DorMFtsv.js.gz 0.73 kB354[frontend:build:proprietary] dist/assets/List-BeJ2XdrD.js.gz 0.75 kB355[frontend:build:proprietary] dist/assets/PageEditor-LTP_4RLU.css.br 0.76 kB356[frontend:build:proprietary] dist/assets/PageLayoutSettings-IzmKAE0a.js.br 0.77 kB357[frontend:build:proprietary] dist/assets/StampPositionFormattingSettings-CkjrW_s2.css.br 0.77 kB358[frontend:build:proprietary] dist/assets/ExtractPages-CILQjW3B.js.gz 0.78 kB359[frontend:build:proprietary] dist/assets/RemovePassword-DDRu-leo.js.gz 0.78 kB360[frontend:build:proprietary] dist/assets/useBaseTool-BykdGST-.js.gz 0.78 kB361[frontend:build:proprietary] dist/assets/styles-BaSic968.css.gz 0.80 kB362[frontend:build:proprietary] dist/assets/AutoRename-OGE7jVx1.js.gz 0.81 kB363[frontend:build:proprietary] dist/assets/ChangePermissions-DQOCEEI8.js.gz 0.83 kB364[frontend:build:proprietary] dist/assets/ShowJS-DZ9Eyz-s.css.gz 0.83 kB365[frontend:build:proprietary] dist/assets/ReplaceColorSettings-l2SYI_Pm.js.gz 0.83 kB366[frontend:build:proprietary] dist/assets/AdjustPageScale-BSokWOJe.js.br 0.84 kB367[frontend:build:proprietary] dist/assets/RemovePages-ja7s9YJT.js.br 0.86 kB368[frontend:build:proprietary] dist/assets/PageLayoutSettings-IzmKAE0a.js.gz 0.90 kB369[frontend:build:proprietary] dist/assets/PageEditor-LTP_4RLU.css.gz 0.93 kB370[frontend:build:proprietary] dist/assets/AppConfigModal-CMCHwpY1.css.br 0.95 kB371[frontend:build:proprietary] dist/assets/TimestampPdf-D3Q1XQ7f.js.br 0.95 kB372[frontend:build:proprietary] dist/assets/AddPageNumbers-CLAWZSrY.js.br 0.97 kB373[frontend:build:proprietary] dist/assets/Flatten-BSP9vsMx.js.br 0.98 kB374[frontend:build:proprietary] dist/assets/StampPositionFormattingSettings-CkjrW_s2.css.gz 0.99 kB375[frontend:build:proprietary] dist/index.html 1.00 kB │ gzip: 0.50 kB376[frontend:build:proprietary] dist/assets/WatermarkFormatting-OlurwIbl.js.br 1.00 kB377[frontend:build:proprietary] dist/assets/AdjustPageScale-BSokWOJe.js.gz 1.02 kB378[frontend:build:proprietary] dist/assets/RemovePages-ja7s9YJT.js.gz 1.02 kB379[frontend:build:proprietary] dist/assets/Compress-CVbY11Zj.js.br 1.03 kB380[frontend:build:proprietary] dist/assets/RemoveBlanks-ro07PGYZ.js.br 1.04 kB381[frontend:build:proprietary] dist/assets/Convert-eFGrW0sx.js.br 1.04 kB382[frontend:build:proprietary] dist/assets/AddAttachments-Cy7gEPcl.js.br 1.05 kB383[frontend:build:proprietary] dist/assets/TimestampPdf-D3Q1XQ7f.js.gz 1.10 kB384[frontend:build:proprietary] dist/assets/FormFill-ChcRngcu.css.br 1.11 kB385[frontend:build:proprietary] dist/assets/AddPageNumbers-CLAWZSrY.js.gz 1.11 kB386[frontend:build:proprietary] dist/assets/PageSelectionSyntaxHint-BzL6Gb5Z.css.br 1.13 kB387[frontend:build:proprietary] dist/assets/AppConfigModal-CMCHwpY1.css.gz 1.13 kB388[frontend:build:proprietary] dist/assets/WordsToRedactInput-Gw8z6rOG.js.br 1.13 kB389[frontend:build:proprietary] dist/assets/ScannerImageSplit-z1kpr8DD.js.br 1.13 kB390[frontend:build:proprietary] dist/assets/ReplaceColor-B5-2NB9e.js.br 1.15 kB391[frontend:build:proprietary] dist/assets/AddAttachmentsSettings-DJY3Z0Y3.js.br 1.16 kB392[frontend:build:proprietary] dist/assets/BookletImpositionSettings-CdorFA6-.js.br 1.17 kB393[frontend:build:proprietary] dist/assets/PageEditorControls-Dzuvwjsa.js.br 1.17 kB394[frontend:build:proprietary] dist/assets/OverlayPdfs-Dln0SaQn.js.br 1.17 kB395[frontend:build:proprietary] dist/assets/AddPassword-Biu-I2c7.js.br 1.18 kB396[frontend:build:proprietary] dist/assets/Convert-eFGrW0sx.js.gz 1.19 kB397[frontend:build:proprietary] dist/assets/Flatten-BSP9vsMx.js.gz 1.20 kB398[frontend:build:proprietary] dist/assets/AddAttachments-Cy7gEPcl.js.gz 1.21 kB399[frontend:build:proprietary] dist/assets/WatermarkFormatting-OlurwIbl.js.gz 1.22 kB400[frontend:build:proprietary] dist/assets/Rotate-DKGIXZ54.js.br 1.23 kB401[frontend:build:proprietary] dist/assets/Viewer-DZevCBcV.css.br 1.23 kB402[frontend:build:proprietary] dist/assets/Compress-CVbY11Zj.js.gz 1.23 kB403[frontend:build:proprietary] dist/assets/OverlayPdfsSettings-Dxvm6gRu.js.br 1.25 kB404[frontend:build:proprietary] dist/assets/BookletImposition-D4WLmOCq.js.br 1.26 kB405[frontend:build:proprietary] dist/assets/RemoveBlanks-ro07PGYZ.js.gz 1.27 kB406[frontend:build:proprietary] dist/assets/PriceDisplay-BBvVjBNh.js.br 1.30 kB407[frontend:build:proprietary] dist/assets/PageEditorControls-Dzuvwjsa.js.gz 1.31 kB408[frontend:build:proprietary] dist/assets/WordsToRedactInput-Gw8z6rOG.js.gz 1.31 kB409[frontend:build:proprietary] dist/assets/PageSelectionSyntaxHint-BzL6Gb5Z.css.gz 1.34 kB410[frontend:build:proprietary] dist/assets/ChangeMetadata-PBQnxyeA.js.br 1.34 kB411[frontend:build:proprietary] dist/assets/ScannerImageSplit-z1kpr8DD.js.gz 1.34 kB412[frontend:build:proprietary] dist/assets/FormFill-ChcRngcu.css.gz 1.35 kB413[frontend:build:proprietary] dist/assets/BookletImpositionSettings-CdorFA6-.js.gz 1.38 kB414[frontend:build:proprietary] dist/assets/AddAttachmentsSettings-DJY3Z0Y3.js.gz 1.38 kB415[frontend:build:proprietary] dist/assets/ReplaceColor-B5-2NB9e.js.gz 1.38 kB416[frontend:build:proprietary] dist/assets/OverlayPdfs-Dln0SaQn.js.gz 1.39 kB417[frontend:build:proprietary] dist/assets/OverlayPdfsSettings-Dxvm6gRu.js.gz 1.40 kB418[frontend:build:proprietary] dist/assets/AddPassword-Biu-I2c7.js.gz 1.43 kB419[frontend:build:proprietary] dist/assets/Rotate-DKGIXZ54.js.gz 1.44 kB420[frontend:build:proprietary] dist/assets/PriceDisplay-BBvVjBNh.js.gz 1.48 kB421[frontend:build:proprietary] dist/assets/Viewer-DZevCBcV.css.gz 1.48 kB422[frontend:build:proprietary] dist/assets/BookletImposition-D4WLmOCq.js.gz 1.49 kB423[frontend:build:proprietary] dist/assets/Table-D7wqMFdx.js.br 1.49 kB424[frontend:build:proprietary] dist/assets/CompressSettings-CK2R1jsF.js.br 1.52 kB425[frontend:build:proprietary] dist/assets/SplitSettings-taX5Or4Z.js.br 1.53 kB426[frontend:build:proprietary] dist/assets/AdjustContrast-CaNaUSa_.js.br 1.59 kB427[frontend:build:proprietary] dist/assets/ChangeMetadata-PBQnxyeA.js.gz 1.62 kB428[frontend:build:proprietary] dist/assets/Accordion-BATVUpqm.js.br 1.64 kB429[frontend:build:proprietary] dist/assets/ColorInput-Bo2ORoBJ.js.br 1.67 kB430[frontend:build:proprietary] dist/assets/Table-D7wqMFdx.js.gz 1.67 kB431[frontend:build:proprietary] dist/assets/useThumbnailGeneration-CFR8YptL.js.br 1.77 kB432[frontend:build:proprietary] dist/assets/CompressSettings-CK2R1jsF.js.gz 1.78 kB433[frontend:build:proprietary] dist/assets/SplitSettings-taX5Or4Z.js.gz 1.79 kB434[frontend:build:proprietary] dist/assets/Accordion-BATVUpqm.js.gz 1.82 kB435[frontend:build:proprietary] dist/assets/AdjustContrast-CaNaUSa_.js.gz 1.82 kB436[frontend:build:proprietary] dist/assets/ColorInput-Bo2ORoBJ.js.gz 1.84 kB437[frontend:build:proprietary] dist/assets/ReorganizePages-D6-uCVgK.js.br 1.84 kB438[frontend:build:proprietary] dist/assets/Merge-CGQQpQJl.js.br 1.90 kB439[frontend:build:proprietary] dist/assets/compareWorker-9BT5gm9c.js.br 1.91 kB440[frontend:build:proprietary] dist/assets/useSavedSignatures-bwNkyDPu.js.br 1.96 kB441[frontend:build:proprietary] dist/assets/useThumbnailGeneration-CFR8YptL.js.gz 1.97 kB442[frontend:build:proprietary] dist/assets/OCR-BRojNlgN.js.br 1.98 kB443[frontend:build:proprietary] dist/assets/createToolFlow-C-Iz9YaX.js.br 2.00 kB444[frontend:build:proprietary] dist/assets/CertSign-DPwySfcn.js.br 2.01 kB445[frontend:build:proprietary] dist/assets/compareWorker-9BT5gm9c.js.gz 2.04 kB446[frontend:build:proprietary] dist/assets/ReorganizePages-D6-uCVgK.js.gz 2.14 kB447[frontend:build:proprietary] dist/assets/Merge-CGQQpQJl.js.gz 2.16 kB448[frontend:build:proprietary] dist/assets/useSavedSignatures-bwNkyDPu.js.gz 2.18 kB449[frontend:build:proprietary] dist/assets/createToolFlow-C-Iz9YaX.js.gz 2.25 kB450[frontend:build:proprietary] dist/assets/FileEditor-BXZhHh82.css.br 2.27 kB451[frontend:build:proprietary] dist/assets/AddWatermark-DOWcGoN7.js.br 2.34 kB452[frontend:build:proprietary] dist/assets/OCR-BRojNlgN.js.gz 2.34 kB453[frontend:build:proprietary] dist/assets/Pagination-De2L2xsZ.js.br 2.40 kB454[frontend:build:proprietary] dist/assets/CertSign-DPwySfcn.js.gz 2.41 kB455[frontend:build:proprietary] dist/assets/Slider-ooREHxvO.js.br 2.49 kB456[frontend:build:proprietary] dist/assets/authentik-Dwk9ywUh.svg.br 2.56 kB457[frontend:build:proprietary] dist/assets/Split-B6XX1xA_.js.br 2.58 kB458[frontend:build:proprietary] dist/assets/AddPageNumbersAppearanceSettings-BNua21v8.js.br 2.63 kB459[frontend:build:proprietary] dist/assets/FileEditor-BXZhHh82.css.gz 2.65 kB460[frontend:build:proprietary] dist/assets/Pagination-De2L2xsZ.js.gz 2.68 kB461[frontend:build:proprietary] dist/assets/ImageUploader-BcsVLp-9.js.br 2.69 kB462[frontend:build:proprietary] dist/assets/Redact-DeKaDM4o.js.br 2.72 kB463[frontend:build:proprietary] dist/assets/Crop-Db1iSoo0.js.br 2.72 kB464[frontend:build:proprietary] dist/assets/Slider-ooREHxvO.js.gz 2.77 kB465[frontend:build:proprietary] dist/assets/AddWatermark-DOWcGoN7.js.gz 2.81 kB466[frontend:build:proprietary] dist/assets/LoginLightModeHeader-BHWFo69e.svg.br 2.83 kB467[frontend:build:proprietary] dist/assets/keycloak-DM6ZSSwi.svg.br 2.87 kB468[frontend:build:proprietary] dist/assets/Compare-CgSSIvn3.css.br 2.94 kB469[frontend:build:proprietary] dist/assets/PageLayout-DuArRgDW.js.br 2.94 kB470[frontend:build:proprietary] dist/assets/ImageUploader-BcsVLp-9.js.gz 3.03 kB471[frontend:build:proprietary] dist/assets/MultiSelect-DoI6zRWA.js.br 3.03 kB472[frontend:build:proprietary] dist/assets/AddPageNumbersAppearanceSettings-BNua21v8.js.gz 3.06 kB473[frontend:build:proprietary] dist/assets/Split-B6XX1xA_.js.gz 3.09 kB474[frontend:build:proprietary] dist/assets/authentik-Dwk9ywUh.svg.gz 3.09 kB475[frontend:build:proprietary] dist/assets/Crop-Db1iSoo0.js.gz 3.10 kB476[frontend:build:proprietary] dist/assets/Redact-DeKaDM4o.js.gz 3.20 kB477[frontend:build:proprietary] dist/assets/SignatureAppearanceSettings-BRZzyQFk.js.br 3.21 kB478[frontend:build:proprietary] dist/assets/keycloak-DM6ZSSwi.svg.gz 3.22 kB479[frontend:build:proprietary] dist/assets/createStampTool-Cum3gR28.js.br 3.27 kB480[frontend:build:proprietary] dist/assets/LoginLightModeHeader-BHWFo69e.svg.gz 3.33 kB481[frontend:build:proprietary] dist/assets/AddStamp-DRfLkmez.js.br 3.35 kB482[frontend:build:proprietary] dist/assets/MultiSelect-DoI6zRWA.js.gz 3.35 kB483[frontend:build:proprietary] dist/assets/Compare-CgSSIvn3.css.gz 3.37 kB484[frontend:build:proprietary] dist/assets/PageLayout-DuArRgDW.js.gz 3.41 kB485[frontend:build:proprietary] dist/assets/SignatureAppearanceSettings-BRZzyQFk.js.gz 3.60 kB486[frontend:build:proprietary] dist/assets/createStampTool-Cum3gR28.js.gz 3.67 kB487[frontend:build:proprietary] dist/assets/AddStamp-DRfLkmez.js.gz 3.74 kB488[frontend:build:proprietary] dist/assets/vendor-react-CW0cBZaz.js.br 3.82 kB489[frontend:build:proprietary] dist/assets/FileManagerView-Cr6XM_Pe.css.br 3.82 kB490[frontend:build:proprietary] dist/assets/FormFill-BKvgQsSI.js.br 4.02 kB491[frontend:build:proprietary] dist/assets/cloudron-CE2lB6-G.svg.br 4.03 kB492[frontend:build:proprietary] dist/assets/ColorPicker-BA3uOqz2.js.br 4.07 kB493[frontend:build:proprietary] dist/assets/ShowJS-CZ1kseyU.js.br 4.19 kB494[frontend:build:proprietary] dist/assets/oidc-CQnNXu0z.svg.br 4.24 kB495[frontend:build:proprietary] dist/assets/ToolStep-D464Ryif.js.br 4.25 kB496[frontend:build:proprietary] dist/assets/vendor-react-CW0cBZaz.js.gz 4.28 kB497[frontend:build:proprietary] dist/assets/FileManagerView-Cr6XM_Pe.css.gz 4.41 kB498[frontend:build:proprietary] dist/assets/OCRSettings-BysYQxn-.js.br 4.41 kB499[frontend:build:proprietary] dist/assets/ColorPicker-BA3uOqz2.js.gz 4.47 kB500[frontend:build:proprietary] dist/assets/FormFill-BKvgQsSI.js.gz 4.51 kB501[frontend:build:proprietary] dist/assets/ShowJS-CZ1kseyU.js.gz 4.66 kB502[frontend:build:proprietary] dist/assets/ToolStep-D464Ryif.js.gz 4.76 kB503[frontend:build:proprietary] dist/assets/cloudron-CE2lB6-G.svg.gz 4.78 kB504[frontend:build:proprietary] dist/assets/ConvertSettings-Dh4AzTKt.js.br 4.99 kB505[frontend:build:proprietary] dist/assets/compareWorker-9BT5gm9c.js 5.14 kB506[frontend:build:proprietary] dist/assets/OCRSettings-BysYQxn-.js.gz 5.16 kB507[frontend:build:proprietary] dist/assets/oidc-CQnNXu0z.svg.gz 5.21 kB508[frontend:build:proprietary] dist/assets/StampPositionFormattingSettings-B5Elvq5f.js.br 5.23 kB509[frontend:build:proprietary] dist/assets/EditTableOfContents-DM4kmemA.js.br 5.24 kB510[frontend:build:proprietary] dist/assets/LoginBackgroundPanel-DkWRvf5z.png 5.43 kB511[frontend:build:proprietary] dist/assets/ConvertSettings-Dh4AzTKt.js.gz 5.66 kB512[frontend:build:proprietary] dist/assets/EditTableOfContents-DM4kmemA.js.gz 5.92 kB513[frontend:build:proprietary] dist/assets/StampPositionFormattingSettings-B5Elvq5f.js.gz 5.99 kB514[frontend:build:proprietary] dist/assets/authentik-Dwk9ywUh.svg 7.02 kB │ gzip: 3.09 kB515[frontend:build:proprietary] dist/assets/GetPdfInfo-d25rvjuR.js.br 7.12 kB516[frontend:build:proprietary] dist/assets/keycloak-DM6ZSSwi.svg 7.58 kB │ gzip: 3.22 kB517[frontend:build:proprietary] dist/assets/GetPdfInfo-d25rvjuR.js.gz 7.98 kB518[frontend:build:proprietary] dist/assets/LoginLightModeHeader-BHWFo69e.svg 7.99 kB │ gzip: 3.33 kB519[frontend:build:proprietary] dist/assets/index-ChI6S0o2.js.br 8.17 kB520[frontend:build:proprietary] dist/assets/Annotate-DJEYEJUE.js.br 8.43 kB521[frontend:build:proprietary] dist/assets/index-ChI6S0o2.js.gz 9.19 kB522[frontend:build:proprietary] dist/assets/useMetadataExtraction-CmPoMeLe.js.br 9.22 kB523[frontend:build:proprietary] dist/assets/Annotate-DJEYEJUE.js.gz 9.50 kB524[frontend:build:proprietary] dist/assets/cloudron-CE2lB6-G.svg 9.74 kB │ gzip: 4.78 kB525[frontend:build:proprietary] dist/assets/useMetadataExtraction-CmPoMeLe.js.gz 10.21 kB526[frontend:build:proprietary] dist/assets/ValidateSignature-BfGFYB8A.js.br 10.28 kB527[frontend:build:proprietary] dist/assets/pick-calendar-levels-props-EryiUE2a.js.br 10.36 kB528[frontend:build:proprietary] dist/assets/SignSettings-Bc73IaV6.js.br 11.46 kB529[frontend:build:proprietary] dist/assets/ValidateSignature-BfGFYB8A.js.gz 11.46 kB530[frontend:build:proprietary] dist/assets/oidc-CQnNXu0z.svg 11.59 kB │ gzip: 5.21 kB531[frontend:build:proprietary] dist/assets/pick-calendar-levels-props-EryiUE2a.js.gz 11.72 kB532[frontend:build:proprietary] dist/assets/SignSettings-Bc73IaV6.js.gz 12.75 kB533[frontend:build:proprietary] dist/assets/FileEditor-aaTvJHkY.js.br 12.77 kB534[frontend:build:proprietary] dist/assets/Automate-BmNAC_Cd.js.br 13.60 kB535[frontend:build:proprietary] dist/assets/FileEditor-aaTvJHkY.js.gz 14.14 kB536[frontend:build:proprietary] dist/assets/Automate-BmNAC_Cd.js.gz 15.39 kB537[frontend:build:proprietary] dist/assets/SharedSign-DjePoK_M.js.br 15.92 kB538[frontend:build:proprietary] dist/assets/FileManagerView-DDZIcm0w.js.br 16.21 kB539[frontend:build:proprietary] dist/assets/SharedSign-DjePoK_M.js.gz 18.17 kB540[frontend:build:proprietary] dist/assets/FileManagerView-DDZIcm0w.js.gz 18.40 kB541[frontend:build:proprietary] dist/assets/Compare-ZxpZaYaQ.js.br 23.54 kB542[frontend:build:proprietary] dist/assets/Compare-ZxpZaYaQ.js.gz 26.67 kB543[frontend:build:proprietary] dist/assets/PdfTextEditor-Bee0XL9J.js.br 27.13 kB544[frontend:build:proprietary] dist/assets/PdfTextEditor-Bee0XL9J.js.gz 31.08 kB545[frontend:build:proprietary] dist/assets/PageEditor-gPj3As_J.js.br 35.99 kB546[frontend:build:proprietary] dist/assets/Viewer-udzHuUwp.js.br 38.67 kB547[frontend:build:proprietary] dist/assets/PageEditor-gPj3As_J.js.gz 40.72 kB548[frontend:build:proprietary] dist/assets/Viewer-udzHuUwp.js.gz 45.37 kB549[frontend:build:proprietary] dist/assets/index-BIRenwS1.css.br 51.53 kB550[frontend:build:proprietary] dist/assets/index-BIRenwS1.css.gz 62.13 kB551[frontend:build:proprietary] dist/assets/AppConfigModal-58zTfFwR.js.br 68.81 kB552[frontend:build:proprietary] dist/assets/AppConfigModal-58zTfFwR.js.gz 84.90 kB553[frontend:build:proprietary] dist/assets/AuditChartsSection-BrH5Cxu3.js.br 93.34 kB554[frontend:build:proprietary] dist/assets/AuditChartsSection-BrH5Cxu3.js.gz 110.50 kB555[frontend:build:proprietary] dist/assets/pixelCompareWorker-CLSuGMj2.js.br 119.93 kB556[frontend:build:proprietary] dist/assets/pixelCompareWorker-CLSuGMj2.js.gz 142.39 kB557[frontend:build:proprietary] dist/assets/pdf-engine-BPdFjzQc.js.br 151.70 kB558[frontend:build:proprietary] dist/assets/pdf-engine-BPdFjzQc.js.gz 199.94 kB559[frontend:build:proprietary] dist/assets/index-DKExZBDM.js.br 222.03 kB560[frontend:build:proprietary] dist/assets/SecurePDF-2883oxel.png 234.49 kB561[frontend:build:proprietary] dist/assets/index-DKExZBDM.js.gz 250.47 kB562[frontend:build:proprietary] dist/assets/pdf.worker.min-DiYokoyG.mjs.br 315.82 kB563[frontend:build:proprietary] dist/assets/pdf.worker.min-DiYokoyG.mjs.gz 382.58 kB564[frontend:build:proprietary] dist/assets/pixelCompareWorker-CLSuGMj2.js 469.75 kB565[frontend:build:proprietary] dist/assets/AddToPDF-BPHLX1DK.png 734.20 kB566[frontend:build:proprietary] dist/assets/index-2TB6MpHU.js.br 821.46 kB567[frontend:build:proprietary] dist/assets/index-2TB6MpHU.js.gz 1,009.88 kB568[frontend:build:proprietary] dist/assets/pdf.worker.min-DiYokoyG.mjs 1,292.87 kB569[frontend:build:proprietary] dist/assets/pdfium-RAgkpwfK.wasm 4,633.79 kB │ gzip: 2,138.03 kB570[frontend:build:proprietary] dist/assets/HoverActionMenu-C_b7tJea.css 0.38 kB │ gzip: 0.27 kB571[frontend:build:proprietary] dist/assets/ObscuredOverlay-qW5WBsHl.css 0.61 kB │ gzip: 0.33 kB572[frontend:build:proprietary] dist/assets/OverlayPdfsSettings-CHa0npci.css 0.67 kB │ gzip: 0.36 kB573[frontend:build:proprietary] dist/assets/ShowJS-DZ9Eyz-s.css 1.85 kB │ gzip: 0.83 kB574[frontend:build:proprietary] dist/assets/AddPageNumbersAppearanceSettings-Bc95VS3p.css 2.11 kB │ gzip: 0.73 kB575[frontend:build:proprietary] dist/assets/PageEditor-LTP_4RLU.css 2.32 kB │ gzip: 0.93 kB576[frontend:build:proprietary] dist/assets/StampPositionFormattingSettings-CkjrW_s2.css 2.50 kB │ gzip: 0.99 kB577[frontend:build:proprietary] dist/assets/styles-BaSic968.css 2.52 kB │ gzip: 0.80 kB578[frontend:build:proprietary] dist/assets/AppConfigModal-CMCHwpY1.css 4.75 kB │ gzip: 1.13 kB579[frontend:build:proprietary] dist/assets/FormFill-ChcRngcu.css 5.05 kB │ gzip: 1.35 kB580[frontend:build:proprietary] dist/assets/PageSelectionSyntaxHint-BzL6Gb5Z.css 5.15 kB │ gzip: 1.34 kB581[frontend:build:proprietary] dist/assets/Viewer-DZevCBcV.css 6.87 kB │ gzip: 1.49 kB582[frontend:build:proprietary] dist/assets/FileEditor-BXZhHh82.css 10.33 kB │ gzip: 2.66 kB583[frontend:build:proprietary] dist/assets/Compare-CgSSIvn3.css 16.82 kB │ gzip: 3.37 kB584[frontend:build:proprietary] dist/assets/FileManagerView-Cr6XM_Pe.css 23.74 kB │ gzip: 4.45 kB585[frontend:build:proprietary] dist/assets/index-BIRenwS1.css 390.07 kB │ gzip: 62.87 kB586[frontend:build:proprietary] dist/assets/Sort-BAyH98zn.js 0.13 kB │ gzip: 0.14 kB587[frontend:build:proprietary] dist/assets/Warning-37v_UMHJ.js 0.14 kB │ gzip: 0.14 kB588[frontend:build:proprietary] dist/assets/TextFields-krUNpcSl.js 0.14 kB │ gzip: 0.15 kB589[frontend:build:proprietary] dist/assets/ViewList-ebgBovHE.js 0.17 kB │ gzip: 0.16 kB590[frontend:build:proprietary] dist/assets/Error-DR5sMY9s.js 0.19 kB │ gzip: 0.17 kB591[frontend:build:proprietary] dist/assets/Save-B8MziS5M.js 0.22 kB │ gzip: 0.19 kB592[frontend:build:proprietary] dist/assets/Undo-DeEGJyIP.js 0.24 kB │ gzip: 0.21 kB593[frontend:build:proprietary] dist/assets/fileStubHelpers-CnAaZ99N.js 0.27 kB │ gzip: 0.23 kB594[frontend:build:proprietary] dist/assets/Refresh-DYEJB5fo.js 0.29 kB │ gzip: 0.24 kB595[frontend:build:proprietary] dist/assets/DownloadRounded-BQX4aOeo.js 0.31 kB │ gzip: 0.23 kB596[frontend:build:proprietary] dist/assets/textUtils-B7NfPJfH.js 0.33 kB │ gzip: 0.22 kB597[frontend:build:proprietary] dist/assets/useWorkbenchBarButtons-DfjDJbDH.js 0.33 kB │ gzip: 0.25 kB598[frontend:build:proprietary] dist/assets/FileUploadButton-4Wm2wgms.js 0.40 kB │ gzip: 0.29 kB599[frontend:build:proprietary] dist/assets/useViewScopedFiles-r_mLNy5_.js 0.42 kB │ gzip: 0.29 kB600[frontend:build:proprietary] dist/assets/ChangePermissionsSettings-lIRbRiFt.js 0.44 kB │ gzip: 0.32 kB601[frontend:build:proprietary] dist/assets/useWheelZoom-W1oI9Gj2.js 0.46 kB │ gzip: 0.35 kB602[frontend:build:proprietary] dist/assets/CropAutomationSettings-CJPnVH-D.js 0.50 kB │ gzip: 0.35 kB603[frontend:build:proprietary] dist/assets/AdjustContrastSingleStepSettings-yTqIEyKd.js 0.51 kB │ gzip: 0.30 kB604[frontend:build:proprietary] dist/assets/RemovePasswordSettings-8p0RdR59.js 0.52 kB │ gzip: 0.33 kB605[frontend:build:proprietary] dist/assets/SliderWithInput-DozGmEc0.js 0.54 kB │ gzip: 0.34 kB606[frontend:build:proprietary] dist/assets/NumberInputWithUnit-CCLxJ79p.js 0.55 kB │ gzip: 0.38 kB607[frontend:build:proprietary] dist/assets/useAccordionSteps-C06hmPyE.js 0.55 kB │ gzip: 0.36 kB608[frontend:build:proprietary] dist/assets/ExtractImagesSettings-CyGkr3UN.js 0.57 kB │ gzip: 0.40 kB609[frontend:build:proprietary] dist/assets/RotateAutomationSettings-DuLUgrOf.js 0.59 kB │ gzip: 0.38 kB610[frontend:build:proprietary] dist/assets/Draw-BikzXnFS.js 0.62 kB │ gzip: 0.40 kB611[frontend:build:proprietary] dist/assets/Code-D3LGOIMl.js 0.63 kB │ gzip: 0.40 kB612[frontend:build:proprietary] dist/assets/ExtractPagesSettings-C73R5SSM.js 0.63 kB │ gzip: 0.42 kB613[frontend:build:proprietary] dist/assets/AddStampAutomationSettings-BOpmeRoe.js 0.67 kB │ gzip: 0.39 kB614[frontend:build:proprietary] dist/assets/MergeSettings-BCKr9u5g.js 0.70 kB │ gzip: 0.37 kB615[frontend:build:proprietary] dist/assets/CertSignAutomationSettings-DQOl_HVr.js 0.70 kB │ gzip: 0.33 kB616[frontend:build:proprietary] dist/assets/ObscuredOverlay-BEXpgTlf.js 0.71 kB │ gzip: 0.36 kB617[frontend:build:proprietary] dist/assets/AddText-CJw3r69t.js 0.79 kB │ gzip: 0.44 kB618[frontend:build:proprietary] dist/assets/AddPageNumbersAutomationSettings-DY4JAgaD.js 0.79 kB │ gzip: 0.41 kB619[frontend:build:proprietary] dist/assets/AddImage-Tb646Kqh.js 0.79 kB │ gzip: 0.44 kB620[frontend:build:proprietary] dist/assets/RemovePagesSettings-Qj4FPdcQ.js 0.80 kB │ gzip: 0.49 kB621[frontend:build:proprietary] dist/assets/Skeleton-eLDy4WPp.js 0.80 kB │ gzip: 0.48 kB622[frontend:build:proprietary] dist/assets/RotateRight-CbQS60gl.js 0.81 kB │ gzip: 0.48 kB623[frontend:build:proprietary] dist/assets/Sign-BRvodSH8.js 0.83 kB │ gzip: 0.47 kB624[frontend:build:proprietary] dist/assets/SplitAutomationSettings-DWQNvDPV.js 0.83 kB │ gzip: 0.49 kB625[frontend:build:proprietary] dist/assets/Repair-aoaj7OXj.js 0.88 kB │ gzip: 0.51 kB626[frontend:build:proprietary] dist/assets/SingleLargePage-D94QSssl.js 0.92 kB │ gzip: 0.54 kB627[frontend:build:proprietary] dist/assets/UnlockPdfForms-CA8BmBdu.js 0.92 kB │ gzip: 0.53 kB628[frontend:build:proprietary] dist/assets/RemoveCertificateSign-Bg1SSUKg.js 0.92 kB │ gzip: 0.53 kB629[frontend:build:proprietary] dist/assets/SanitizeSettings-3lbHI0SD.js 0.94 kB │ gzip: 0.51 kB630[frontend:build:proprietary] dist/assets/RedactSingleStepSettings-iiLiurgN.js 0.96 kB │ gzip: 0.51 kB631[frontend:build:proprietary] dist/assets/RemoveImage-8K3P726t.js 0.97 kB │ gzip: 0.55 kB632[frontend:build:proprietary] dist/assets/HoverActionMenu-CINW9fxu.js 1.00 kB │ gzip: 0.57 kB633[frontend:build:proprietary] dist/assets/AdjustContrastColorSettings-BYt-VepI.js 1.00 kB │ gzip: 0.37 kB634[frontend:build:proprietary] dist/assets/AddWatermarkSingleStepSettings-DX5Lx78V.js 1.01 kB │ gzip: 0.48 kB635[frontend:build:proprietary] dist/assets/signaturePreview-B95QiOc8.js 1.05 kB │ gzip: 0.60 kB636[frontend:build:proprietary] dist/assets/FlattenSettings-DWJsZVxh.js 1.11 kB │ gzip: 0.61 kB637[frontend:build:proprietary] dist/assets/ButtonSelector-C-oVwO0F.js 1.12 kB │ gzip: 0.58 kB638[frontend:build:proprietary] dist/assets/ExtractImages-izgJURDD.js 1.21 kB │ gzip: 0.62 kB639[frontend:build:proprietary] dist/assets/Sanitize-BvRY6Wjx.js 1.21 kB │ gzip: 0.63 kB640[frontend:build:proprietary] dist/assets/AddPasswordSettings-BAHyvnTp.js 1.26 kB │ gzip: 0.54 kB641[frontend:build:proprietary] dist/assets/RemoveBlanksSettings-DXS1kW8y.js 1.35 kB │ gzip: 0.65 kB642[frontend:build:proprietary] dist/assets/PageSelectionSyntaxHint-BkZlj5B4.js 1.37 kB │ gzip: 0.68 kB643[frontend:build:proprietary] dist/assets/ChangeMetadataSingleStep-y6vBqYAs.js 1.41 kB │ gzip: 0.53 kB644[frontend:build:proprietary] dist/assets/AdjustPageScaleSettings-Sfss_fMC.js 1.45 kB │ gzip: 0.69 kB645[frontend:build:proprietary] dist/assets/RemoveAnnotations-D9_YCXIR.js 1.46 kB │ gzip: 0.73 kB646[frontend:build:proprietary] dist/assets/useBaseTool-BykdGST-.js 1.47 kB │ gzip: 0.78 kB647[frontend:build:proprietary] dist/assets/usePageSelectionTips-BWconWbz.js 1.50 kB │ gzip: 0.65 kB648[frontend:build:proprietary] dist/assets/ExtractPages-CILQjW3B.js 1.53 kB │ gzip: 0.78 kB649[frontend:build:proprietary] dist/assets/List-BeJ2XdrD.js 1.54 kB │ gzip: 0.75 kB650[frontend:build:proprietary] dist/assets/RemovePassword-DDRu-leo.js 1.58 kB │ gzip: 0.78 kB651[frontend:build:proprietary] dist/assets/use-move-CmntEdrY.js 1.64 kB │ gzip: 0.70 kB652[frontend:build:proprietary] dist/assets/AutoRename-OGE7jVx1.js 1.67 kB │ gzip: 0.81 kB653[frontend:build:proprietary] dist/assets/ScannerImageSplitSettings-BB9Pvcvh.js 1.71 kB │ gzip: 0.64 kB654[frontend:build:proprietary] dist/assets/ChangePermissions-DQOCEEI8.js 1.74 kB │ gzip: 0.83 kB655[frontend:build:proprietary] dist/assets/CropCoordinateInputs-DorMFtsv.js 1.91 kB │ gzip: 0.73 kB656[frontend:build:proprietary] dist/assets/PageLayoutSettings-IzmKAE0a.js 2.03 kB │ gzip: 0.90 kB657[frontend:build:proprietary] dist/assets/TimestampPdf-D3Q1XQ7f.js 2.23 kB │ gzip: 1.10 kB658[frontend:build:proprietary] dist/assets/AddPageNumbers-CLAWZSrY.js 2.27 kB │ gzip: 1.11 kB659[frontend:build:proprietary] dist/assets/ReplaceColorSettings-l2SYI_Pm.js 2.33 kB │ gzip: 0.83 kB660[frontend:build:proprietary] dist/assets/AdjustPageScale-BSokWOJe.js 2.35 kB │ gzip: 1.02 kB661[frontend:build:proprietary] dist/assets/Convert-eFGrW0sx.js 2.36 kB │ gzip: 1.19 kB662[frontend:build:proprietary] dist/assets/AddAttachments-Cy7gEPcl.js 2.45 kB │ gzip: 1.21 kB663[frontend:build:proprietary] dist/assets/RemovePages-ja7s9YJT.js 2.45 kB │ gzip: 1.02 kB664[frontend:build:proprietary] dist/assets/Flatten-BSP9vsMx.js 2.72 kB │ gzip: 1.20 kB665[frontend:build:proprietary] dist/assets/Compress-CVbY11Zj.js 2.76 kB │ gzip: 1.23 kB666[frontend:build:proprietary] dist/assets/WordsToRedactInput-Gw8z6rOG.js 3.03 kB │ gzip: 1.31 kB667[frontend:build:proprietary] dist/assets/AddAttachmentsSettings-DJY3Z0Y3.js 3.09 kB │ gzip: 1.38 kB668[frontend:build:proprietary] dist/assets/RemoveBlanks-ro07PGYZ.js 3.10 kB │ gzip: 1.27 kB669[frontend:build:proprietary] dist/assets/ScannerImageSplit-z1kpr8DD.js 3.14 kB │ gzip: 1.34 kB670[frontend:build:proprietary] dist/assets/Rotate-DKGIXZ54.js 3.29 kB │ gzip: 1.44 kB671[frontend:build:proprietary] dist/assets/AddPassword-Biu-I2c7.js 3.29 kB │ gzip: 1.43 kB672[frontend:build:proprietary] dist/assets/WatermarkFormatting-OlurwIbl.js 3.30 kB │ gzip: 1.22 kB673[frontend:build:proprietary] dist/assets/OverlayPdfs-Dln0SaQn.js 3.45 kB │ gzip: 1.39 kB674[frontend:build:proprietary] dist/assets/ReplaceColor-B5-2NB9e.js 3.47 kB │ gzip: 1.38 kB675[frontend:build:proprietary] dist/assets/PriceDisplay-BBvVjBNh.js 3.52 kB │ gzip: 1.48 kB676[frontend:build:proprietary] dist/assets/PageEditorControls-Dzuvwjsa.js 3.55 kB │ gzip: 1.31 kB677[frontend:build:proprietary] dist/assets/OverlayPdfsSettings-Dxvm6gRu.js 3.77 kB │ gzip: 1.40 kB678[frontend:build:proprietary] dist/assets/BookletImposition-D4WLmOCq.js 3.93 kB │ gzip: 1.49 kB679[frontend:build:proprietary] dist/assets/ColorInput-Bo2ORoBJ.js 3.98 kB │ gzip: 1.84 kB680[frontend:build:proprietary] dist/assets/AdjustContrast-CaNaUSa_.js 4.06 kB │ gzip: 1.82 kB681[frontend:build:proprietary] dist/assets/BookletImpositionSettings-CdorFA6-.js 4.09 kB │ gzip: 1.38 kB682[frontend:build:proprietary] dist/assets/Table-D7wqMFdx.js 4.25 kB │ gzip: 1.67 kB683[frontend:build:proprietary] dist/assets/CompressSettings-CK2R1jsF.js 4.43 kB │ gzip: 1.78 kB684[frontend:build:proprietary] dist/assets/Merge-CGQQpQJl.js 4.63 kB │ gzip: 2.16 kB685[frontend:build:proprietary] dist/assets/Accordion-BATVUpqm.js 4.63 kB │ gzip: 1.82 kB686[frontend:build:proprietary] dist/assets/ReorganizePages-D6-uCVgK.js 5.09 kB │ gzip: 2.14 kB687[frontend:build:proprietary] dist/assets/ChangeMetadata-PBQnxyeA.js 5.18 kB │ gzip: 1.62 kB688[frontend:build:proprietary] dist/assets/useThumbnailGeneration-CFR8YptL.js 5.21 kB │ gzip: 1.97 kB689[frontend:build:proprietary] dist/assets/createToolFlow-C-Iz9YaX.js 5.37 kB │ gzip: 2.25 kB690[frontend:build:proprietary] dist/assets/SplitSettings-taX5Or4Z.js 5.66 kB │ gzip: 1.79 kB691[frontend:build:proprietary] dist/assets/OCR-BRojNlgN.js 5.78 kB │ gzip: 2.34 kB692[frontend:build:proprietary] dist/assets/useSavedSignatures-bwNkyDPu.js 6.46 kB │ gzip: 2.18 kB693[frontend:build:proprietary] dist/assets/Slider-ooREHxvO.js 6.92 kB │ gzip: 2.77 kB694[frontend:build:proprietary] dist/assets/ImageUploader-BcsVLp-9.js 6.94 kB │ gzip: 3.03 kB695[frontend:build:proprietary] dist/assets/Pagination-De2L2xsZ.js 7.03 kB │ gzip: 2.68 kB696[frontend:build:proprietary] dist/assets/CertSign-DPwySfcn.js 7.30 kB │ gzip: 2.41 kB697[frontend:build:proprietary] dist/assets/AddPageNumbersAppearanceSettings-BNua21v8.js 7.51 kB │ gzip: 3.06 kB698[frontend:build:proprietary] dist/assets/Crop-Db1iSoo0.js 7.79 kB │ gzip: 3.10 kB699[frontend:build:proprietary] dist/assets/createStampTool-Cum3gR28.js 8.20 kB │ gzip: 3.67 kB700[frontend:build:proprietary] dist/assets/Redact-DeKaDM4o.js 8.60 kB │ gzip: 3.20 kB701[frontend:build:proprietary] dist/assets/MultiSelect-DoI6zRWA.js 8.67 kB │ gzip: 3.35 kB702[frontend:build:proprietary] dist/assets/AddWatermark-DOWcGoN7.js 8.89 kB │ gzip: 2.82 kB703[frontend:build:proprietary] dist/assets/Split-B6XX1xA_.js 8.97 kB │ gzip: 3.09 kB704[frontend:build:proprietary] dist/assets/AddStamp-DRfLkmez.js 9.55 kB │ gzip: 3.74 kB705[frontend:build:proprietary] dist/assets/PageLayout-DuArRgDW.js 10.46 kB │ gzip: 3.42 kB706[frontend:build:proprietary] dist/assets/ShowJS-CZ1kseyU.js 11.33 kB │ gzip: 4.66 kB707[frontend:build:proprietary] dist/assets/ColorPicker-BA3uOqz2.js 11.92 kB │ gzip: 4.47 kB708[frontend:build:proprietary] dist/assets/vendor-react-CW0cBZaz.js 11.97 kB │ gzip: 4.28 kB709[frontend:build:proprietary] dist/assets/ToolStep-D464Ryif.js 12.16 kB │ gzip: 4.76 kB710[frontend:build:proprietary] dist/assets/FormFill-BKvgQsSI.js 12.77 kB │ gzip: 4.51 kB711[frontend:build:proprietary] dist/assets/SignatureAppearanceSettings-BRZzyQFk.js 13.49 kB │ gzip: 3.60 kB712[frontend:build:proprietary] dist/assets/OCRSettings-BysYQxn-.js 15.93 kB │ gzip: 5.19 kB713[frontend:build:proprietary] dist/assets/StampPositionFormattingSettings-B5Elvq5f.js 18.69 kB │ gzip: 5.99 kB714[frontend:build:proprietary] dist/assets/EditTableOfContents-DM4kmemA.js 19.42 kB │ gzip: 5.93 kB715[frontend:build:proprietary] dist/assets/ConvertSettings-Dh4AzTKt.js 22.99 kB │ gzip: 5.67 kB716[frontend:build:proprietary] dist/assets/GetPdfInfo-d25rvjuR.js 26.05 kB │ gzip: 8.00 kB717[frontend:build:proprietary] dist/assets/index-ChI6S0o2.js 27.33 kB │ gzip: 9.19 kB718[frontend:build:proprietary] dist/assets/useMetadataExtraction-CmPoMeLe.js 31.58 kB │ gzip: 10.22 kB719[frontend:build:proprietary] dist/assets/Annotate-DJEYEJUE.js 34.95 kB │ gzip: 9.52 kB720[frontend:build:proprietary] dist/assets/ValidateSignature-BfGFYB8A.js 35.64 kB │ gzip: 11.48 kB721[frontend:build:proprietary] dist/assets/pick-calendar-levels-props-EryiUE2a.js 41.93 kB │ gzip: 11.73 kB722[frontend:build:proprietary] dist/assets/FileEditor-aaTvJHkY.js 42.38 kB │ gzip: 14.15 kB723[frontend:build:proprietary] dist/assets/SignSettings-Bc73IaV6.js 43.20 kB │ gzip: 12.78 kB724[frontend:build:proprietary] dist/assets/Automate-BmNAC_Cd.js 48.09 kB │ gzip: 15.41 kB725[frontend:build:proprietary] dist/assets/SharedSign-DjePoK_M.js 66.05 kB │ gzip: 18.23 kB726[frontend:build:proprietary] dist/assets/FileManagerView-DDZIcm0w.js 66.57 kB │ gzip: 18.45 kB727[frontend:build:proprietary] dist/assets/Compare-ZxpZaYaQ.js 80.53 kB │ gzip: 26.68 kB728[frontend:build:proprietary] dist/assets/PdfTextEditor-Bee0XL9J.js 90.67 kB │ gzip: 31.14 kB729[frontend:build:proprietary] dist/assets/PageEditor-gPj3As_J.js 126.31 kB │ gzip: 40.80 kB730[frontend:build:proprietary] dist/assets/Viewer-udzHuUwp.js 152.00 kB │ gzip: 45.46 kB731[frontend:build:proprietary] dist/assets/AuditChartsSection-BrH5Cxu3.js 375.16 kB │ gzip: 110.73 kB732[frontend:build:proprietary] dist/assets/AppConfigModal-58zTfFwR.js 381.75 kB │ gzip: 85.15 kB733[frontend:build:proprietary] dist/assets/index-DKExZBDM.js 602.78 kB │ gzip: 250.67 kB734[frontend:build:proprietary] dist/assets/pdf-engine-BPdFjzQc.js 1,043.84 kB │ gzip: 201.35 kB735[frontend:build:proprietary] dist/assets/index-2TB6MpHU.js 3,400.28 kB │ gzip: 1,012.69 kB736[frontend:build:proprietary] 737[frontend:build:proprietary] (!) Some chunks are larger than 500 kB after minification. Consider:738[frontend:build:proprietary] - Using dynamic import() to code-split the application739[frontend:build:proprietary] - Use build.rollupOptions.output.manualChunks to improve chunking: https://rollupjs.org/configuration-options/#output-manualchunks740[frontend:build:proprietary] - Adjust chunk size limit for this warning via build.chunkSizeWarningLimit.741[frontend:build:proprietary] [prerender-og] wrote 152 prerendered route pages (root-relative URLs)742[frontend:build:proprietary] dist/sw-folder-retry.js.gz 1.27 kB743[frontend:build:proprietary] dist/images/google-drive.svg.gz 0.59 kB744[frontend:build:proprietary] dist/images/google-drive.svg.br 0.54 kB745[frontend:build:proprietary] dist/sw-folder-retry.js.br 1.03 kB746[frontend:build:proprietary] dist/css/cookieconsentCustomisation.css.gz 1.92 kB747[frontend:build:proprietary] dist/og-metadata.json.gz 4.16 kB748[frontend:build:proprietary] dist/css/cookieconsent.css.gz 5.30 kB749[frontend:build:proprietary] dist/css/cookieconsentCustomisation.css.br 1.58 kB750[frontend:build:proprietary] dist/og-metadata.json.br 3.50 kB751[frontend:build:proprietary] dist/css/cookieconsent.css.br 4.72 kB752[frontend:build:proprietary] dist/js/thirdParty/cookieconsent.umd.js.gz 10.17 kB753[frontend:build:proprietary] dist/js/thirdParty/cookieconsent.umd.js.br 9.06 kB754[frontend:build:proprietary] dist/locales/ar-AR/translation.toml.br 87.08 kB755[frontend:build:proprietary] dist/locales/az-AZ/translation.toml.br 88.26 kB756[frontend:build:proprietary] dist/locales/bg-BG/translation.toml.br 93.18 kB757[frontend:build:proprietary] dist/locales/en-GB/translation.toml.gz 97.97 kB758[frontend:build:proprietary] dist/locales/ar-AR/translation.toml.gz 111.60 kB759[frontend:build:proprietary] dist/locales/az-AZ/translation.toml.gz 108.54 kB760[frontend:build:proprietary] dist/locales/da-DK/translation.toml.br 84.73 kB761[frontend:build:proprietary] dist/locales/ca-CA/translation.toml.gz 106.54 kB762[frontend:build:proprietary] dist/locales/cs-CZ/translation.toml.gz 109.12 kB763[frontend:build:proprietary] dist/locales/ca-CA/translation.toml.br 86.69 kB764[frontend:build:proprietary] dist/locales/da-DK/translation.toml.gz 102.67 kB765[frontend:build:proprietary] dist/locales/de-DE/translation.toml.gz 108.88 kB766[frontend:build:proprietary] dist/locales/cs-CZ/translation.toml.br 88.46 kB767[frontend:build:proprietary] dist/locales/bg-BG/translation.toml.gz 122.26 kB768[frontend:build:proprietary] dist/locales/bo-CN/translation.toml.br 95.26 kB769[frontend:build:proprietary] dist/locales/de-DE/translation.toml.br 89.12 kB770[frontend:build:proprietary] dist/locales/el-GR/translation.toml.gz 127.16 kB771[frontend:build:proprietary] dist/locales/el-GR/translation.toml.br 95.48 kB772[frontend:build:proprietary] dist/locales/en-US/translation.toml.gz 98.07 kB773[frontend:build:proprietary] dist/locales/bo-CN/translation.toml.gz 125.28 kB774[frontend:build:proprietary] dist/locales/en-US/translation.toml.br 79.04 kB775[frontend:build:proprietary] dist/locales/es-ES/translation.toml.gz 105.85 kB776[frontend:build:proprietary] dist/locales/eu-ES/translation.toml.gz 104.92 kB777[frontend:build:proprietary] dist/locales/en-GB/translation.toml.br 79.02 kB778[frontend:build:proprietary] dist/locales/es-ES/translation.toml.br 85.86 kB779[frontend:build:proprietary] dist/locales/fa-IR/translation.toml.gz 114.12 kB780[frontend:build:proprietary] dist/locales/eu-ES/translation.toml.br 86.19 kB781[frontend:build:proprietary] dist/locales/fr-FR/translation.toml.gz 108.48 kB782[frontend:build:proprietary] dist/locales/ga-IE/translation.toml.gz 111.32 kB783[frontend:build:proprietary] dist/locales/fa-IR/translation.toml.br 88.94 kB784[frontend:build:proprietary] dist/locales/fr-FR/translation.toml.br 87.76 kB785[frontend:build:proprietary] dist/locales/hr-HR/translation.toml.br 87.49 kB786[frontend:build:proprietary] dist/locales/hu-HU/translation.toml.br 89.80 kB787[frontend:build:proprietary] dist/locales/ga-IE/translation.toml.br 90.34 kB788[frontend:build:proprietary] dist/locales/hr-HR/translation.toml.gz 106.62 kB789[frontend:build:proprietary] dist/locales/hu-HU/translation.toml.gz 110.97 kB790[frontend:build:proprietary] dist/locales/id-ID/translation.toml.gz 100.57 kB791[frontend:build:proprietary] dist/locales/it-IT/translation.toml.gz 103.42 kB792[frontend:build:proprietary] dist/locales/id-ID/translation.toml.br 82.62 kB793[frontend:build:proprietary] dist/locales/it-IT/translation.toml.br 85.00 kB794[frontend:build:proprietary] dist/locales/ja-JP/translation.toml.gz 109.57 kB795[frontend:build:proprietary] dist/locales/ko-KR/translation.toml.br 83.17 kB796[frontend:build:proprietary] dist/locales/ko-KR/translation.toml.gz 105.17 kB797[frontend:build:proprietary] dist/locales/hi-IN/translation.toml.br 92.59 kB798[frontend:build:proprietary] dist/locales/ja-JP/translation.toml.br 85.33 kB799[frontend:build:proprietary] dist/locales/hi-IN/translation.toml.gz 122.77 kB800[frontend:build:proprietary] dist/locales/nl-NL/translation.toml.gz 105.26 kB801[frontend:build:proprietary] dist/locales/no-NB/translation.toml.gz 102.04 kB802[frontend:build:proprietary] dist/locales/nl-NL/translation.toml.br 86.49 kB803[frontend:build:proprietary] dist/locales/pl-PL/translation.toml.gz 108.79 kB804[frontend:build:proprietary] dist/locales/ml-ML/translation.toml.gz 130.07 kB805[frontend:build:proprietary] dist/locales/no-NB/translation.toml.br 84.08 kB806[frontend:build:proprietary] dist/locales/pt-BR/translation.toml.gz 103.11 kB807[frontend:build:proprietary] dist/locales/pt-PT/translation.toml.gz 105.73 kB808[frontend:build:proprietary] dist/locales/pt-BR/translation.toml.br 85.75 kB809[frontend:build:proprietary] dist/locales/ro-RO/translation.toml.gz 107.33 kB810[frontend:build:proprietary] dist/locales/pl-PL/translation.toml.br 88.58 kB811[frontend:build:proprietary] dist/locales/pt-PT/translation.toml.br 85.77 kB812[frontend:build:proprietary] dist/locales/ro-RO/translation.toml.br 87.62 kB813[frontend:build:proprietary] dist/locales/ml-ML/translation.toml.br 97.38 kB814[frontend:build:proprietary] dist/locales/sk-SK/translation.toml.gz 109.78 kB815[frontend:build:proprietary] dist/locales/sk-SK/translation.toml.br 89.05 kB816[frontend:build:proprietary] dist/locales/sl-SI/translation.toml.gz 105.68 kB817[frontend:build:proprietary] dist/locales/sl-SI/translation.toml.br 86.67 kB818[frontend:build:proprietary] dist/locales/sr-LATN-RS/translation.toml.gz 106.33 kB819[frontend:build:proprietary] dist/locales/sr-LATN-RS/translation.toml.br 87.28 kB820[frontend:build:proprietary] dist/locales/ru-RU/translation.toml.gz 123.10 kB821[frontend:build:proprietary] dist/locales/sv-SE/translation.toml.gz 103.30 kB822[frontend:build:proprietary] dist/locales/sv-SE/translation.toml.br 84.81 kB823[frontend:build:proprietary] dist/locales/tr-TR/translation.toml.br 87.57 kB824[frontend:build:proprietary] dist/locales/tr-TR/translation.toml.gz 107.32 kB825[frontend:build:proprietary] dist/locales/ru-RU/translation.toml.br 93.10 kB826[frontend:build:proprietary] dist/locales/vi-VN/translation.toml.gz 103.52 kB827[frontend:build:proprietary] dist/locales/uk-UA/translation.toml.br 93.94 kB828[frontend:build:proprietary] dist/locales/uk-UA/translation.toml.gz 123.34 kB829[frontend:build:proprietary] dist/locales/th-TH/translation.toml.gz 116.68 kB830[frontend:build:proprietary] dist/locales/vi-VN/translation.toml.br 83.43 kB831[frontend:build:proprietary] dist/vendor/jscanify/jscanify.js.gz 2.03 kB832[frontend:build:proprietary] dist/locales/zh-BO/translation.toml.gz 107.03 kB833[frontend:build:proprietary] dist/locales/zh-CN/translation.toml.gz 102.33 kB834[frontend:build:proprietary] dist/locales/zh-BO/translation.toml.br 83.66 kB835[frontend:build:proprietary] dist/locales/zh-TW/translation.toml.gz 106.13 kB836[frontend:build:proprietary] dist/vendor/jscanify/jscanify.js.br 1.75 kB837[frontend:build:proprietary] dist/locales/th-TH/translation.toml.br 88.32 kB838[frontend:build:proprietary] dist/locales/zh-CN/translation.toml.br 80.74 kB839[frontend:build:proprietary] dist/locales/zh-TW/translation.toml.br 83.07 kB840[frontend:build:proprietary] dist/vendor/jscanify/opencv.js.gz 2,874.76 kB841[frontend:build:proprietary] dist/vendor/jscanify/opencv.js.br 2,054.50 kB842[frontend:build:proprietary] ✓ built in 5m 5s843[frontend:build:proprietary] 844845[Incubating] Problems report is available at: file:///build/source/build/reports/problems/problems-report.html846847FAILURE: Build failed with an exception.848849* What went wrong:850Execution failed for task ':common:compileJava'.851> Could not resolve all files for configuration ':common:compileClasspath'.852 > Could not resolve org.apache.pdfbox:pdfbox:3.0.8.853 Required by:854 project :common855 > Could not resolve org.apache.pdfbox:pdfbox:3.0.8.856 > Could not parse POM https://repo.maven.apache.org/maven2/org/apache/pdfbox/pdfbox/3.0.8/pdfbox-3.0.8.pom857 > Content is not allowed in prolog.858 > Could not resolve org.apache.pdfbox:pdfbox-io:3.0.8.859 Required by:860 project :common861 > Could not resolve org.apache.pdfbox:pdfbox-io:3.0.8.862 > Could not parse POM https://repo.maven.apache.org/maven2/org/apache/pdfbox/pdfbox-io/3.0.8/pdfbox-io-3.0.8.pom863 > Content is not allowed in prolog.864 > Could not resolve org.apache.pdfbox:xmpbox:3.0.8.865 Required by:866 project :common867 > Could not resolve org.apache.pdfbox:xmpbox:3.0.8.868 > Could not parse POM https://repo.maven.apache.org/maven2/org/apache/pdfbox/xmpbox/3.0.8/xmpbox-3.0.8.pom869 > Could not resolve org.apache.pdfbox:pdfbox-parent:3.0.8.870 > Could not resolve org.apache.pdfbox:pdfbox-parent:3.0.8.871 > Could not parse POM https://repo.maven.apache.org/maven2/org/apache/pdfbox/pdfbox-parent/3.0.8/pdfbox-parent-3.0.8.pom872 > Content is not allowed in prolog.873 > Could not resolve org.apache.pdfbox:preflight:3.0.8.874 Required by:875 project :common876 > Could not resolve org.apache.pdfbox:preflight:3.0.8.877 > Could not parse POM https://repo.maven.apache.org/maven2/org/apache/pdfbox/preflight/3.0.8/preflight-3.0.8.pom878 > Content is not allowed in prolog.879> There is 1 more failure with an identical cause.880881* Try:882> Run with --stacktrace option to get the stack trace.883> Run with --info or --debug option to get more log output.884> Run with --scan to get full insights.885> Get more help at https://help.gradle.org.886887Deprecated Gradle features were used in this build, making it incompatible with Gradle 9.0.888889You can use '--warning-mode all' to show the individual deprecation warnings and determine if they come from your own scripts or plugins.890891For more on this, please refer to https://docs.gradle.org/8.14.4/userguide/command_line_interface.html#sec:command_line_warnings in the Gradle documentation.892893BUILD FAILED in 26m 29s8945 actionable tasks: 4 executed, 1 up-to-date